{"text_format":"1","workbook":"xlsx","n_sheets":7,"sheets":["EDITOR","daten","bilder","bilder2","rennfarben","rennfarben2","info"],"not_rendered":{"charts":2,"images":8,"macros":1,"external_links":0,"defined_names":0,"comments":0,"pivot_tables":0},"unopened":[],"bounds":{"document_bytes":16777216,"sheet_cells":100000,"rows_first":2000,"rows_last":500,"rows_between":2000,"halvings":0,"cell_chars":16384,"cell_head_chars":4096},"cells_cut":0,"cells_raw":0,"read":"whole","date_system":"1900"}

{"sheet":"EDITOR","index":0,"n_rows":30,"n_cols":34,"rows_kept":30,"cut":false,"hidden":false,"merged":[[20,33,33,33],[4,25,6,30],[12,25,12,26]]}
[]
[null,"GaloppSim Pferde-Editor",null,null,null,null,null,null,null,null,null,null,null,null,null,null,null,null,null,null,null,null,null,null,"ß","Kompakte Vorschau mit Optionen zum Versenden an info@galoppsim.racing"]
[]
[null,"Die Rennfarbe des Pferds und das Bild können nur mit "]
[null,"Hintergrundfarben editiert werden. Zellinhalte werden",null,null,null,null,null,null,null,null,null,null,null,null,null,null,null,null,null,null,null,null,"Name der Pferds",null,"ß","Der Name des Pferds und des Rennstalls können frei gewählt werden."]
[null,"ignoriert. Im Dropdown-Menü gibt es Vorlagen."]
[null,null,null,null,null,null,null,null,null,null,null,null,null,null,null,null,null,null,null,null,null,null,"Name des Rennstalls",null,"ß"]
[null,null,null,null,null,null,null,"â","â","â","â","â","â","â","â"]
[null,null,null,null,null,"Schwanz",null,null,null,null,null,null,null,null,null,null,"Kopf",null,null,null,null,"ß","Rennfarbe"]
[]
[]
["à",null,null,null,null,null,null,null,null,null,null,null,null,null,null,null,null,null,null,null,null,null,"Bild des Pferds",null,"ß","Für neue Pferde: Standardbild, Vorlagen und"]
["à",null,null,null,null,null,null,null,null,null,null,null,null,null,null,null,null,null,null,null,null,null,null,null,null,"zwischengespeicherte",null,"Bilder"]
["à"]
["à",null,null,null,null,null,null,null,null,null,null,null,null,null,null,null,null,null,null,null,null,null,null,null,"ß","Für Rennstallbesitzer, die ihr Pferd schon gemeldet haben:"]
["à",null,null,null,null,null,null,null,null,null,null,null,null,null,null,null,null,null,null,null,null,null,null,null,null,"hier das eigene Pferd auswählen"]
["à"]
["à",null,null,null,null,null,null,null,null,null,null,null,null,null,null,null,null,null,null,null,null,null,"Renntaktik",null,null,"Die Geschwindigkeit des Pferds kann über die Renndistanz eingeteilt werden. "]
["à",null,null,null,null,null,null,null,null,null,null,null,null,null,null,null,null,null,null,null,null,null,null,null,"ß","Aktuell:","mittel >> langsam >> langsam >> mittel >> langsam >> schnell"]
["à"]
["à",null,null,null,null,null,null,null,null,null,null,null,null,null,null,null,null,null,null,null,null,null,null,null,null,null,null,null,null,null,null,null,null,{"$f":"IF(daten!A10<12,\"Zu niedrig ausgelastet\",\"Optimal ausgelastet\")&CHAR(10)&\"(\"&ROUND((100*SUM(daten!B2:B7)/12),0)&\"%)\"","v":"Zu niedrig ausgelastet\n(83%)"}]
["à"]
["à",null,null,null,null,null,null,null,null,null,null,null,null,null,null,null,null,null,null,null,null,null,"Renndistanz (Meter)",1800]
["à",null,null,null,null,null,null,null,null,null,null,null,null,null,null,null,null,null,null,null,null,null,null,"--> nur für die Beschriftung der Streckenabschnitte"]
["à"]
["à"]
["à"]
["à"]
["à"]
[null,"á","á","á","á","á","á","á","á","á","á","á","á","á","á","á","á","á","á","á","á"]

{"sheet":"daten","index":1,"n_rows":10,"n_cols":8,"rows_kept":10,"cut":false,"hidden":true,"merged":[]}
[{"$f":"+EDITOR!W23","v":"Renndistanz (Meter)"},null,null,null,null,1,"S","langsam"]
[{"$f":"ROUND(EDITOR!$X$23/6*(COUNT($B$2:$B$7)-COUNT(B2:$B$7)+1),0)&\"m\"","v":"300m"},2,{"$f":"+VLOOKUP(B2,F:H,3,FALSE)","v":"mittel"},{"$f":"+VLOOKUP(B2,F:H,2,FALSE)","v":"M"},null,2,"M","mittel"]
[{"$f":"ROUND(EDITOR!$X$23/6*(COUNT($B$2:$B$7)-COUNT(B3:$B$7)+1),0)&\"m\"","v":"600m"},1,{"$f":"+VLOOKUP(B3,F:H,3,FALSE)","v":"langsam"},{"$f":"+VLOOKUP(B3,F:H,2,FALSE)","v":"S"},null,3,"F","schnell"]
[{"$f":"ROUND(EDITOR!$X$23/6*(COUNT($B$2:$B$7)-COUNT(B4:$B$7)+1),0)&\"m\"","v":"900m"},1,"langsam","S"]
[{"$f":"ROUND(EDITOR!$X$23/6*(COUNT($B$2:$B$7)-COUNT(B5:$B$7)+1),0)&\"m\"","v":"1200m"},2,"mittel","M"]
[{"$f":"ROUND(EDITOR!$X$23/6*(COUNT($B$2:$B$7)-COUNT(B6:$B$7)+1),0)&\"m\"","v":"1500m"},1,"langsam","S"]
[{"$f":"ROUND(EDITOR!$X$23/6*(COUNT($B$2:$B$7)-COUNT(B7:$B$7)+1),0)&\"m\"","v":"1800m"},3,"schnell","F"]
[]
["eingeplant","noch frei"]
[{"$f":"+SUM(B2:B7)","v":10},{"$f":"12-A10","v":2}]

{"sheet":"bilder","index":2,"n_rows":361,"n_cols":4,"rows_kept":361,"cut":false,"hidden":true,"merged":[]}
["Standardbild","Vorlage 1","Vorlage 2","Vorlage 3"]
[16777215,16777215,16777215,16777215]
[16777215,16777215,16777215,16777215]
[16777215,16777215,16777215,16777215]
[16777215,16777215,16777215,16777215]
[16777215,16777215,16777215,16777215]
[16777215,16777215,16777215,16777215]
[16777215,16777215,16777215,0]
[16777215,16777215,16777215,16777215]
[16777215,16777215,16777215,16777215]
[16777215,16777215,16777215,16777215]
[16777215,16777215,16777215,16777215]
[16777215,16777215,16777215,0]
[16777215,16777215,16777215,16777215]
[16777215,16777215,16777215,16777215]
[16777215,16777215,16777215,16777215]
[16777215,16777215,16777215,16777215]
[16777215,16777215,16777215,16777215]
[16777215,16777215,16777215,16777215]
[16777215,16777215,16777215,16777215]
[16777215,16777215,16777215,16777215]
[16777215,16777215,16777215,16777215]
[16777215,16777215,16777215,16777215]
[16777215,16777215,16777215,16777215]
[16777215,16777215,16777215,16777215]
[16777215,16777215,16777215,16777215]
[16777215,16777215,16777215,16777215]
[16777215,16777215,16777215,0]
[16777215,16777215,16777215,0]
[16777215,16777215,16777215,16777215]
[16777215,16777215,16777215,16777215]
[16777215,16777215,16777215,0]
[16777215,16777215,16777215,0]
[16777215,16777215,16777215,16777215]
[16777215,16777215,16777215,16777215]
[16777215,16777215,16777215,16777215]
[16777215,16777215,16777215,16777215]
[16777215,16777215,16777215,16777215]
[16777215,16777215,16777215,16777215]
[16777215,16777215,16777215,16777215]
[16777215,16777215,16777215,16777215]
[16777215,16777215,16777215,16777215]
[16777215,16777215,16777215,16777215]
[16777215,16777215,16777215,16777215]
[16777215,16777215,16777215,16777215]
[16777215,16777215,16777215,16777215]
[16777215,16777215,16777215,16777215]
[16777215,16777215,16777215,0]
[16777215,16777215,16777215,16777215]
[16777215,16777215,16777215,0]
[16777215,16777215,16777215,0]
[16777215,16777215,16777215,16777215]
[16777215,16777215,0,0]
[16777215,16777215,16777215,16777215]
[16777215,16777215,0,16777215]
[16777215,16777215,16777215,16777215]
[16777215,16777215,16777215,16777215]
[16777215,16777215,16777215,16777215]
[16777215,16777215,16777215,16777215]
[16777215,16777215,16777215,16777215]
[16777215,16777215,16777215,16777215]
[16777215,16777215,16777215,16777215]
[16777215,16777215,16777215,16777215]
[16777215,16777215,16777215,16777215]
[16777215,16777215,16777215,16777215]
[16777215,16777215,16777215,16777215]
[36799,16777215,16777215,16777215]
[16777215,0,16777215,0]
[16777215,16777215,16777215,16777215]
[36799,16777215,16777215,16777215]
[16777215,16777215,16777215,16777215]
[16777215,16777215,16777215,16777215]
[16777215,16777215,0,16777215]
[16777215,16777215,16777215,0]
[16777215,16777215,0,0]
[16777215,16777215,16777215,16777215]
[16777215,16777215,16777215,16777215]
[16777215,16777215,16777215,16777215]
[16777215,16777215,16777215,16777215]
[16777215,16777215,16777215,16777215]
[16777215,16777215,16777215,16777215]
[16777215,16777215,16777215,16777215]
[16777215,16777215,16777215,16777215]
[16777215,16777215,16777215,16777215]
[16777215,16777215,16777215,16777215]
[16777215,16777215,16777215,16777215]
[36799,16777215,16777215,0]
[36799,0,16777215,16777215]
[16777215,16777215,16777215,16777215]
[36799,16777215,16777215,16777215]
[36799,16777215,16777215,16777215]
[16777215,0,16777215,16777215]
[16777215,16777215,0,16777215]
[16777215,16777215,16777215,16777215]
[16777215,16777215,16777215,0]
[16777215,16777215,16777215,16777215]
[16777215,16777215,16777215,16777215]
[16777215,16777215,16777215,16777215]
[16777215,16777215,16777215,16777215]
[16777215,16777215,16777215,16777215]
[16777215,16777215,16777215,16777215]
[16777215,16777215,16777215,16777215]
[16777215,16777215,16777215,16777215]
[16777215,16777215,16777215,16777215]
[16777215,16777215,16777215,16777215]
[16777215,16777215,16777215,0]
[36799,16777215,16777215,16777215]
[36799,16777215,16777215,16777215]
[24704,0,16777215,16777215]
[36799,16777215,16777215,16777215]
[36799,16777215,16777215,16777215]
[16777215,0,16777215,16777215]
[16777215,16777215,16777215,16777215]
[16777215,16777215,16777215,16777215]
[16777215,16777215,16777215,16777215]
[16777215,16777215,16777215,0]
[16777215,16777215,16777215,0]
[16777215,16777215,16777215,16777215]
[16777215,16777215,16777215,16777215]
[16777215,16777215,16777215,16777215]
[16777215,16777215,16777215,16777215]
[16777215,16777215,16777215,16777215]
[16777215,16777215,16777215,16777215]
[16777215,16777215,16777215,16777215]
[16777215,16777215,16777215,0]
[16777215,16777215,16777215,16777215]
[16777215,16777215,16777215,16777215]
[36799,0,16777215,16777215]
[36799,16777215,16777215,16777215]
[36799,16777215,16777215,16777215]
[36799,16777215,16777215,16777215]
[24704,0,16777215,16777215]
[24704,0,16777215,16777215]
[16777215,16777215,16777215,16777215]
[16777215,16777215,16777215,16777215]
[16777215,16777215,0,16777215]
[16777215,16777215,0,0]
[16777215,16777215,16777215,0]
[16777215,16777215,16777215,0]
[16777215,16777215,16777215,16777215]
[16777215,16777215,16777215,16777215]
[16777215,16777215,0,16777215]
[16777215,16777215,0,0]
[16777215,16777215,0,0]
[16777215,16777215,0,16777215]
[16777215,0,0,16777215]
[36799,0,0,16777215]
[36799,16777215,0,16777215]
[0,16777215,0,16777215]
[36799,16777215,0,16777215]
[36799,16777215,0,16777215]
[36799,16777215,16777215,16777215]
[24704,16777215,16777215,16777215]
[24704,16777215,16777215,16777215]
[16777215,16777215,16777215,16777215]
[16777215,16777215,16777215,16777215]
[16777215,16777215,16777215,16777215]
[16777215,16777215,16777215,16777215]
[16777215,16777215,16777215,0]
[16777215,16777215,16777215,0]
[16777215,16777215,16777215,0]
[16777215,16777215,16777215,0]
[16777215,16777215,16777215,16777215]
[16777215,16777215,16777215,16777215]
[36799,0,16777215,16777215]
[36799,16777215,16777215,16777215]
[36799,16777215,16777215,16777215]
[36799,16777215,16777215,16777215]
[36799,16777215,16777215,16777215]
[36799,16777215,16777215,16777215]
[36799,16777215,16777215,16777215]
[36799,16777215,16777215,16777215]
[36799,16777215,16777215,16777215]
[24704,0,16777215,16777215]
[24704,16777215,16777215,16777215]
[16777215,16777215,16777215,16777215]
[16777215,16777215,16777215,16777215]
[16777215,16777215,16777215,16777215]
[16777215,16777215,0,16777215]
[16777215,16777215,16777215,16777215]
[16777215,16777215,16777215,16777215]
[16777215,16777215,16777215,0]
[16777215,16777215,16777215,16777215]
[36799,0,16777215,16777215]
[36799,16777215,16777215,16777215]
[36799,16777215,16777215,16777215]
[36799,16777215,16777215,16777215]
[36799,16777215,16777215,16777215]
[36799,16777215,16777215,16777215]
[36799,16777215,16777215,16777215]
[36799,16777215,16777215,16777215]
[36799,16777215,16777215,16777215]
[36799,16777215,16777215,16777215]
[36799,16777215,16777215,16777215]
[36799,16777215,16777215,16777215]
[36799,0,16777215,16777215]
[36799,0,16777215,16777215]
[36799,0,16777215,16777215]
[36799,16777215,16777215,16777215]
[36799,16777215,16777215,16777215]
[16777215,16777215,16777215,16777215]
[16777215,16777215,16777215,0]
[36799,16777215,16777215,16777215]
[36799,0,16777215,16777215]
[36799,16777215,16777215,16777215]
[36799,16777215,16777215,16777215]
[36799,16777215,16777215,16777215]
[36799,16777215,16777215,16777215]
[36799,16777215,16777215,0]
[16777215,16777215,16777215,0]
[36799,16777215,16777215,16777215]
[36799,16777215,16777215,16777215]
[36799,16777215,16777215,16777215]
[36799,16777215,16777215,16777215]
[36799,16777215,16777215,16777215]
[36799,16777215,16777215,16777215]
[36799,16777215,16777215,16777215]
[36799,16777215,16777215,16777215]
[36799,0,16777215,16777215]
[36799,0,0,16777215]
[16777215,0,16777215,16777215]
[16777215,16777215,16777215,16777215]
[36799,16777215,16777215,0]
[24704,0,16777215,16777215]
[36799,16777215,16777215,16777215]
[36799,16777215,16777215,16777215]
[36799,16777215,16777215,0]
[16777215,16777215,16777215,0]
[16777215,0,16777215,16777215]
[16777215,16777215,16777215,16777215]
[36799,16777215,16777215,0]
[36799,16777215,16777215,16777215]
[36799,16777215,16777215,16777215]
[36799,16777215,16777215,16777215]
[36799,16777215,16777215,16777215]
[36799,16777215,16777215,16777215]
[36799,16777215,16777215,16777215]
[36799,16777215,16777215,16777215]
[36799,16777215,16777215,16777215]
[36799,16777215,0,16777215]
[16777215,16777215,16777215,16777215]
[16777215,16777215,16777215,16777215]
[16777215,16777215,16777215,16777215]
[36799,0,16777215,0]
[36799,16777215,16777215,0]
[16777215,16777215,16777215,0]
[16777215,16777215,16777215,16777215]
[16777215,0,16777215,16777215]
[16777215,16777215,16777215,16777215]
[16777215,16777215,16777215,16777215]
[16777215,0,16777215,16777215]
[36799,16777215,16777215,0]
[36799,16777215,16777215,16777215]
[36799,16777215,0,16777215]
[36799,16777215,0,16777215]
[36799,16777215,16777215,16777215]
[36799,16777215,16777215,16777215]
[36799,16777215,16777215,16777215]
[36799,16777215,0,16777215]
[36799,16777215,16777215,16777215]
[16777215,16777215,16777215,16777215]
[16777215,16777215,16777215,16777215]
[16777215,16777215,16777215,16777215]
[16777215,16777215,16777215,16777215]
[16777215,0,16777215,16777215]
[16777215,0,16777215,16777215]
[16777215,0,0,16777215]
[16777215,16777215,0,16777215]
[16777215,16777215,0,16777215]
[16777215,16777215,0,16777215]
[16777215,0,16777215,16777215]
[16777215,16777215,16777215,16777215]
[16777215,16777215,16777215,0]
[36799,16777215,16777215,16777215]
[36799,16777215,16777215,16777215]
[36799,16777215,16777215,16777215]
[36799,16777215,0,16777215]
[36799,16777215,0,16777215]
[36799,16777215,16777215,16777215]
[36799,16777215,16777215,16777215]
[16777215,16777215,16777215,16777215]
[16777215,16777215,16777215,16777215]
[16777215,16777215,16777215,16777215]
[16777215,16777215,16777215,16777215]
[16777215,16777215,0,16777215]
[16777215,16777215,16777215,16777215]
[16777215,16777215,16777215,16777215]
[16777215,16777215,16777215,16777215]
[16777215,16777215,16777215,16777215]
[16777215,16777215,16777215,16777215]
[16777215,16777215,16777215,16777215]
[16777215,16777215,0,16777215]
[16777215,16777215,16777215,16777215]
[16777215,16777215,16777215,0]
[36799,16777215,16777215,16777215]
[36799,16777215,16777215,16777215]
[36799,16777215,16777215,16777215]
[36799,16777215,16777215,16777215]
[36799,16777215,16777215,16777215]
[36799,16777215,16777215,16777215]
[16777215,16777215,16777215,16777215]
[16777215,16777215,16777215,16777215]
[16777215,16777215,16777215,16777215]
[16777215,16777215,16777215,16777215]
[16777215,16777215,0,16777215]
[16777215,16777215,16777215,16777215]
[16777215,16777215,16777215,16777215]
[16777215,16777215,16777215,16777215]
[16777215,16777215,16777215,16777215]
[16777215,16777215,16777215,16777215]
[16777215,16777215,16777215,16777215]
[16777215,16777215,0,16777215]
[16777215,16777215,16777215,16777215]
[16777215,16777215,16777215,0]
[36799,16777215,16777215,16777215]
[36799,16777215,16777215,16777215]
[36799,16777215,16777215,16777215]
[36799,16777215,16777215,16777215]
[16777215,0,16777215,16777215]
[16777215,0,16777215,16777215]
[16777215,0,16777215,0]
[16777215,16777215,16777215,16777215]
[16777215,16777215,16777215,16777215]
[16777215,16777215,16777215,16777215]
[16777215,16777215,0,16777215]
[16777215,16777215,16777215,16777215]
[16777215,16777215,16777215,16777215]
[16777215,16777215,16777215,16777215]
[16777215,16777215,16777215,16777215]
[16777215,16777215,16777215,16777215]
[16777215,16777215,16777215,16777215]
[16777215,16777215,0,16777215]
[16777215,0,16777215,16777215]
[16777215,16777215,16777215,0]
[16777215,16777215,16777215,16777215]
[16777215,16777215,16777215,16777215]
[16777215,0,16777215,16777215]
[16777215,16777215,16777215,16777215]
[16777215,16777215,16777215,16777215]
[16777215,16777215,16777215,0]
[16777215,16777215,16777215,16777215]
[16777215,16777215,16777215,16777215]
[16777215,16777215,16777215,16777215]
[16777215,16777215,16777215,16777215]
[16777215,16777215,16777215,16777215]
[16777215,16777215,16777215,16777215]
[16777215,16777215,16777215,16777215]
[16777215,16777215,16777215,16777215]
[16777215,16777215,16777215,16777215]
[16777215,16777215,16777215,16777215]
[16777215,16777215,16777215,16777215]
[16777215,16777215,16777215,16777215]
[16777215,0,16777215,16777215]
[16777215,16777215,16777215,0]
[16777215,16777215,16777215,16777215]
[16777215,16777215,16777215,16777215]
[16777215,0,16777215,16777215]
[16777215,16777215,16777215,16777215]
[16777215,16777215,16777215,16777215]
[16777215,16777215,16777215,0]
[16777215,16777215,16777215,16777215]

{"sheet":"bilder2","index":3,"n_rows":361,"n_cols":117,"rows_kept":361,"cut":false,"hidden":true,"merged":[]}
["Adonijo","Ailton","Al Capone","Äther","AustrianStallion","AustrianStallion (mit Maulschutz)","Besenwagen","Binary","Black Beauty","Bob","Boccaccio","Chefchen","Chewbacca","Cora","Danny DeVito","Dark Knight Rising","Darkwing","De Bij","De Wesp","Diversity","Duli","Easy","Elektrogaul","Ente Süß Sauer","Feenstaub","Felaróf","Fellow Horse","Frank the Highlander","Galopper des Jahrtausends","Galopper des Jahrtausends 1","Galopper des Jahrtausends 2","Galopper des Jahrtausends 3","Galopper des Jahrtausends 4","Galopper des Jahrtausends 5","Galopper des Jahrtausends 6","Galopper des Jahrtausends 7","Galopper des Jahrtausends 8","Galopper des Jahrtausends 9","Galopper des Jahrtausends 10","Galopper des Jahrtausends 11","Ghost","Grashüpfer","Graupi","Green Tentacle","Herr Nilson","Honeyjune","HORSE_2","IboProfen","JohnnyPony","Joint","Jolly Jumper","Kalle","Kieler Sprotte","Kleiner Onkel","Ladybird","Lampard One","Langes Elend","Liese (2019)","Liese (2020)","Louis","Lula von Elmshorn","Mohrenköpfle","Momentum III","Momentum III (mit Maulschutz)","Mordhorse","Mysekaja","Niki","Old Moe","Onepointninebillion","Ono Sternengalopp","Pablo WhiteNose","Pommes Rot Weiß","Pride of Doom","Purple Tentacle","Ramba-Zamba","Rennpony","Rennpony (gesattelt)","Rennpony (mit Maulschutz)","Rennpony (GMP 2020)","Rennpony (CCup 2021)","Rosso Corsa","Run Algorithm Run","Sa'Yaan","Schalk im Nacken","Scharfer Maxx","Schnecki","Shadow of Doom","Shetler-Pony","SiegOderWurst2","Sir Oliver","Sir Prance-a-lot","SolMan","Stallone Gorgon Zola","Stampede","Sternengalopp","Suppenschüssel","Tricky Treasury","Tútastic","Velociraptext","Wandissimo","Wirbelwind","Yulifee","Zimtstern","Zimtstern (2)","Zimtstern (mit Maulschutz)","WINNER_HORSE_LIESE2020","WINNER_HORSE_BOCCACCIO","WINNER_HORSE_AUSTRIANSTALLION_MAULSCHUTZ","WINNER_HORSE_STALLONEGORGONZOLA","WINNER_HORSE_SCHARFERMAXX","WINNER_HORSE_GALOPPERDESJAHRTAUSENDS9","WINNER_HORSE_STAMPEDE","WINNER_HORSE_WANDISSIMO","WINNER_HORSE_PABLOWHITENOSE","WINNER_HORSE_CORA","WINNER_HORSE_AETHER","WINNER_HORSE_MOMENTUMIII"]
[16777215,16777215,16777215,16777215,9359529,9359529,16777215,16777215,16777215,16777215,16777215,16777215,16777215,16777215,16777215,16777215,16777215,16777215,16777215,16777215,16777215,16777215,16777215,16777215,16777215,16777215,16777215,16777215,16777215,16777215,16777215,16777215,16777215,16777215,16777215,16777215,16777215,16777215,16777215,16777215,16777215,16777215,16777215,16777215,16711680,16777215,16777215,16777215,16777215,16777215,16777215,16777215,16777215,16711680,16777215,16777215,16777215,16777215,16777215,16777215,16777215,16777215,16777215,16777215,16777215,16777215,16777215,16777215,16777215,16777215,16777215,16777215,16777215,16777215,16777215,16777215,16777215,16777215,16777215,16777215,16777215,16777215,16777215,16777215,16777215,16777215,16777215,16777215,16777215,16777215,16777215,16777215,16777215,16777215,16777215,16777215,16777215,16777215,16777215,16777215,16777215,16777215,16777215,16777215,16777215,16777215,16777215,9359529,16777215,16777215,16777215,16777215,16777215,16777215,16777215,16777215,16777215]
[16777215,16777215,16777215,16777215,9359529,9359529,16777215,16777215,16777215,16777215,16777215,16777215,16777215,16777215,16777215,16777215,16777215,16777215,16777215,16777215,16777215,16777215,16777215,16777215,16777215,16777215,16777215,16777215,16777215,16777215,16777215,16777215,16777215,16777215,16777215,16777215,16777215,16777215,16777215,16777215,16777215,16777215,16777215,16777215,16711680,16777215,16777215,16777215,16777215,16777215,16777215,16777215,16777215,16711680,16777215,16777215,16777215,16777215,16777215,16777215,16777215,16777215,16777215,16777215,16777215,16777215,16777215,16777215,16777215,16777215,16777215,16777215,16777215,16777215,16777215,16777215,16777215,16777215,16777215,16777215,16777215,16777215,16777215,16777215,16777215,16777215,16777215,16777215,16777215,16777215,16777215,16777215,16777215,16777215,16777215,16777215,16777215,16777215,16777215,16777215,16777215,16777215,16777215,16777215,16777215,16777215,16777215,9359529,16777215,16777215,16777215,16777215,16777215,16777215,16777215,16777215,16777215]
[16777215,16777215,16777215,16777215,9359529,9359529,16777215,16777215,16777215,16777215,16777215,16777215,16777215,16777215,16777215,16777215,16777215,16777215,16777215,16777215,16777215,16777215,16777215,16777215,16777215,16777215,0,16777215,16777215,16777215,16777215,16777215,16777215,16777215,16777215,16777215,16777215,16777215,16777215,16777215,16777215,16777215,16777215,16777215,16711680,16777215,16777215,16777215,16777215,16777215,16777215,16777215,16777215,16711680,16777215,16777215,16777215,16777215,16777215,16777215,16777215,16777215,16777215,16777215,16777215,16777215,16777215,16777215,16777215,16777215,16777215,16777215,16777215,16777215,16777215,16777215,16777215,16777215,16777215,16777215,16777215,16777215,16777215,16777215,16777215,16777215,16777215,16777215,16777215,16777215,16777215,16777215,16777215,16777215,16777215,16777215,16777215,16777215,16777215,16777215,16777215,16777215,16777215,16777215,16777215,16777215,16777215,9359529,16777215,16777215,16777215,16777215,16777215,16777215,16777215,16777215,16777215]
[16777215,16777215,16777215,16777215,9359529,9359529,16777215,16777215,16777215,16777215,16777215,16777215,16777215,16777215,16777215,16777215,0,16777215,16777215,16777215,16777215,16777215,16777215,16777215,16777215,11573124,16777215,16777215,16777215,16777215,16777215,16777215,16777215,16777215,16777215,16777215,16777215,16777215,16777215,16777215,16777215,16777215,16777215,16777215,16711680,16777215,16777215,16777215,16777215,16777215,16777215,16777215,16777215,16711680,16777215,16777215,16777215,16777215,16777215,16777215,16777215,16777215,16777215,16777215,16777215,16777215,16777215,16777215,16777215,16777215,16777215,16777215,16777215,16777215,16777215,16777215,16777215,16777215,16777215,16777215,16777215,16777215,16777215,16777215,16777215,16777215,16777215,16777215,16777215,16777215,16777215,16777215,16777215,16777215,16777215,16777215,16777215,16777215,16777215,16777215,16777215,16777215,16777215,16777215,16777215,16777215,16777215,9359529,16777215,16777215,16777215,16777215,16777215,16777215,16777215,16777215,16777215]
[16777215,16777215,16777215,16777215,9359529,9359529,16777215,16777215,16777215,16777215,16777215,16777215,16777215,16777215,16777215,16777215,16777215,16777215,16777215,16777215,16777215,16777215,16777215,16777215,16777215,16777215,16777215,16777215,16777215,16777215,16777215,16777215,16777215,16777215,16777215,16777215,16777215,16777215,16777215,16777215,16777215,16777215,16777215,16777215,16711680,16777215,16777215,16777215,16777215,16777215,16777215,16777215,16777215,16711680,16777215,16777215,801923,16777215,16777215,16777215,16777215,16777215,16777215,16777215,3770805,16777215,16777215,16777215,16777215,16777215,16777215,16777215,16777215,16777215,16777215,16777215,16777215,16777215,16777215,16777215,16777215,16777215,16777215,16777215,16777215,16777215,16777215,16777215,16777215,16777215,0,16777215,16777215,16777215,16777215,16777215,16777215,16777215,16777215,16777215,16777215,16777215,16777215,16777215,16777215,16777215,16777215,9359529,16777215,16777215,16777215,16777215,16777215,16777215,16777215,16777215,16777215]
[16777215,16777215,16777215,16777215,9359529,9359529,16777215,16777215,16777215,16777215,16777215,16777215,16777215,16777215,16777215,16777215,16777215,16777215,16777215,16777215,16777215,16777215,16777215,16777215,16777215,16777215,16777215,16777215,16777215,16777215,16777215,16777215,16777215,16777215,16777215,16777215,16777215,16777215,16777215,16777215,16777215,16777215,16777215,16777215,16711680,16777215,16777215,16777215,16777215,16777215,16777215,16777215,16777215,16711680,16777215,16777215,16777215,16777215,16777215,16777215,16777215,16777215,16777215,16777215,16777215,16777215,16777215,16777215,16777215,16777215,16777215,16777215,16777215,16777215,16777215,16777215,16777215,16777215,16777215,16777215,16777215,16777215,16777215,16777215,16777215,16777215,16777215,16777215,16777215,16777215,16777215,16777215,16777215,16777215,16777215,16777215,16777215,16777215,16777215,16777215,16777215,16777215,16777215,16777215,16777215,16777215,16777215,9359529,16777215,16777215,16777215,16777215,16777215,16777215,16777215,16777215,16777215]
[16777215,16777215,16777215,16777215,9359529,9359529,16777215,16777215,16777215,16777215,16777215,16777215,16777215,16777215,16777215,16777215,16777215,15921906,15921906,16777215,16777215,16777215,16777215,16777215,0,16777215,16777215,16777215,16777215,16777215,16777215,16777215,16777215,16777215,16777215,16777215,16777215,16777215,16777215,16777215,0,10086143,16777215,16777215,16711680,16777215,16777215,16777215,16777215,16777215,16777215,3368601,16777215,16711680,16777215,16777215,16777215,16777215,16777215,1137094,16777215,16777215,16777215,16777215,0,16777215,16777215,16777215,16777215,16777215,16777215,16777215,16777215,16777215,16777215,16777215,16777215,16777215,16777215,16777215,16777215,16777215,15921906,16777215,16777215,16777215,16777215,16777215,16777215,16777215,16777215,16777215,16777215,16777215,0,16777215,16777215,16777215,16777215,0,16777215,16777215,16777215,16777215,16777215,16777215,16777215,9359529,16777215,16777215,16777215,16777215,0,16777215,16777215,16777215,16777215]
[16777215,16777215,5934,16777215,9359529,9359529,16777215,16777215,16777215,16777215,16777215,16777215,16777215,666680,16777215,0,16777215,16777215,16777215,16777215,666680,16777215,16777215,7434613,16777215,16777215,16777215,16777215,16777215,16777215,16777215,16777215,16777215,16777215,16777215,16777215,16777215,16777215,16777215,16777215,0,10086143,16777215,16777215,65280,16777215,16777215,16777215,16777215,666680,16777215,3368601,16777215,65280,16777215,16777215,16777215,16777215,16777215,16777215,16777215,16777215,16777215,16777215,0,16777215,3684410,16777215,16777215,16777215,16777215,666680,16777215,16777215,16777215,16777215,16777215,16777215,16777215,16777215,16777215,16777215,16777215,16777215,16777215,16777215,16777215,16777215,16777215,16777215,16777215,16777215,16777215,16777215,0,16777215,16777215,16777215,16777215,16777215,16777215,16777215,16777215,0,0,16777215,16777215,9359529,16777215,16777215,16777215,16777215,16777215,16777215,666680,16777215,16777215]
[16777215,16777215,16777215,16777215,9359529,9359529,16777215,16777215,16777215,16777215,16777215,16777215,16777215,16777215,16777215,16777215,16777215,16777215,16777215,16777215,16777215,16777215,16777215,16777215,16777215,16777215,16777215,16777215,16777215,16777215,16777215,16777215,16777215,16777215,16777215,16777215,16777215,16777215,16777215,16777215,16777215,10086143,16777215,16777215,65280,16777215,16777215,16777215,16777215,16777215,16777215,3368601,16777215,65280,16777215,16777215,16777215,16777215,16777215,16777215,16777215,16777215,16777215,16777215,16777215,16777215,16777215,16777215,16777215,16777215,16777215,16777215,16777215,16777215,16777215,16777215,16777215,16777215,16777215,16777215,16777215,16777215,16777215,16777215,0,16777215,16777215,16777215,16777215,16777215,16777215,16777215,0,16777215,16777215,16777215,16777215,16777215,16777215,16777215,16777215,16777215,16777215,16777215,16777215,16777215,16777215,9359529,0,0,16777215,16777215,16777215,16777215,16777215,16777215,16777215]
[16777215,16777215,16777215,16777215,19816,19816,16777215,16777215,16777215,16777215,16777215,16777215,16777215,16777215,16777215,16777215,0,16777215,16777215,16777215,16777215,16777215,16777215,16777215,16777215,11573124,16777215,16777215,16777215,16777215,16777215,16777215,16777215,16777215,16777215,16777215,16777215,16777215,16777215,16777215,16777215,10086143,16777215,16777215,65280,16777215,16777215,16777215,16777215,16777215,16777215,16777215,16777215,65280,16777215,16777215,16777215,16777215,16777215,16777215,16777215,16777215,16777215,16777215,16777215,16777215,16777215,16777215,11838,16777215,16777215,16777215,16777215,16777215,16777215,16764057,16764057,16764057,16764057,16764057,16777215,11838,16777215,16777215,16777215,16777215,16777215,16777215,16777215,16777215,16777215,16777215,16777215,16777215,16777215,16777215,16777215,16777215,16777215,16777215,16777215,16777215,16777215,16777215,16777215,16777215,16777215,19816,16777215,16777215,16777215,16777215,16777215,16777215,16777215,16777215,16777215]
[16777215,16777215,16777215,16777215,19816,19816,16777215,16777215,16777215,16777215,16777215,16777215,16777215,16777215,16777215,16777215,16777215,16777215,16777215,16777215,16777215,16777215,16777215,16777215,16777215,16777215,16777215,16777215,0,0,0,0,0,0,0,0,0,0,0,0,16777215,10086143,16777215,16777215,65280,16777215,16777215,16777215,16777215,16777215,16777215,16777215,16777215,65280,16777215,16777215,16777215,16777215,16777215,16777215,16777215,16777215,16777215,16777215,16777215,16777215,16777215,16777215,16777215,16777215,16777215,16777215,16777215,16777215,16777215,16764057,16764057,16764057,16764057,16764057,16777215,16777215,15921906,16777215,16777215,16777215,16777215,16777215,16777215,16777215,16777215,16777215,16777215,16777215,16777215,16777215,16777215,16777215,16777215,16777215,16777215,16777215,16777215,16777215,16777215,16777215,16777215,19816,16777215,16777215,0,16777215,16777215,16777215,16777215,16777215,16777215]
[16777215,16777215,16777215,16777215,9359529,9359529,16777215,16777215,16777215,16777215,16777215,16777215,16777215,16777215,16777215,16777215,16777215,15921906,15921906,16777215,16777215,16777215,16777215,16777215,0,16777215,16777215,16777215,16777215,16777215,16777215,16777215,16777215,16777215,16777215,16777215,16777215,16777215,16777215,16777215,16777215,16777215,16777215,16777215,65280,16777215,16777215,16777215,16777215,16777215,16777215,16777215,16777215,65280,11389944,16777215,16777215,16777215,16777215,1137094,16777215,16777215,16777215,16777215,16777215,16777215,16777215,16777215,11838,16777215,16777215,16777215,16777215,16777215,16777215,16777215,16777215,16777215,16777215,16777215,16777215,11838,16777215,16777215,16777215,16777215,16777215,16777215,16777215,16777215,16777215,16777215,16777215,16777215,16777215,16777215,16777215,16777215,16777215,0,16777215,16777215,16777215,0,0,16777215,16777215,9359529,16777215,16777215,16777215,16777215,0,16777215,16777215,16777215,16777215]
[16777215,16777215,16777215,16777215,19816,19816,16777215,16777215,16777215,16777215,16777215,16777215,16777215,16777215,16777215,16777215,16777215,16777215,16777215,16777215,16777215,16777215,16777215,16777215,16777215,16777215,16777215,16777215,16777215,16777215,16777215,16777215,16777215,16777215,16777215,16777215,16777215,16777215,16777215,16777215,16777215,16777215,16777215,16777215,65280,16777215,16777215,16777215,16777215,16777215,16777215,16777215,16777215,65280,16777215,16777215,16777215,16777215,16777215,16777215,16777215,16777215,16777215,16777215,16777215,16777215,16777215,16777215,16777215,16777215,16777215,16777215,16777215,16777215,16777215,16764057,16764057,16764057,16764057,16764057,16777215,16777215,16777215,16777215,16777215,16777215,16777215,16777215,16777215,16777215,16777215,8421504,16777215,16777215,16777215,16777215,16777215,16777215,16777215,16777215,16777215,16777215,16777215,16777215,16777215,16777215,16777215,19816,16777215,16777215,16777215,16777215,16777215,16777215,16777215,16777215,16777215]
[16777215,16777215,16777215,16777215,9359529,9359529,16777215,16777215,16777215,16777215,16777215,16777215,16777215,16777215,16777215,16777215,16777215,16777215,16777215,16777215,16777215,16777215,16777215,16777215,16777215,16777215,16777215,16777215,16777215,16777215,16777215,16777215,16777215,16777215,16777215,16777215,16777215,16777215,16777215,16777215,16777215,16777215,16777215,16777215,65280,16777215,16777215,16777215,16777215,16777215,16777215,16777215,16777215,65280,16777215,16777215,16777215,16777215,16777215,16777215,16777215,16777215,16777215,16777215,16777215,16777215,16777215,16777215,16777215,16777215,16777215,16777215,16777215,16777215,16777215,16777215,16777215,16777215,16777215,16777215,16777215,16777215,16777215,16777215,6740479,16777215,16777215,16777215,16777215,16777215,16777215,8421504,6740479,16777215,16777215,16777215,16777215,16777215,16777215,16777215,16777215,16777215,16777215,16777215,16777215,16777215,16777215,9359529,6740479,6740479,16777215,16777215,16777215,16777215,16777215,16777215,16777215]
[16777215,16777215,16777215,16777215,9359529,9359529,16777215,16777215,16777215,16777215,16777215,16777215,16777215,16777215,16777215,16777215,16777215,16777215,16777215,16777215,16777215,16777215,16777215,16777215,16777215,16777215,16777215,16777215,16777215,16777215,16777215,16777215,16777215,16777215,16777215,16777215,16777215,16777215,16777215,16777215,16777215,16777215,16777215,16777215,65280,16777215,16777215,16777215,16777215,16777215,16777215,16777215,16777215,65280,16777215,16777215,801923,16777215,16777215,16777215,16777215,16777215,16777215,16777215,16777215,16777215,16777215,16777215,16777215,16777215,16777215,16777215,16777215,16777215,16777215,16777215,16777215,16777215,16777215,16777215,16777215,16777215,16777215,16777215,6740479,16777215,16777215,16777215,16777215,16777215,16777215,16777215,6740479,16777215,16777215,16777215,16777215,16777215,16777215,16777215,16777215,16777215,16777215,16777215,16777215,16777215,16777215,9359529,6740479,6740479,16777215,16777215,16777215,16777215,16777215,16777215,16777215]
[16777215,16777215,16777215,16777215,9359529,9359529,16777215,16777215,801923,16777215,16777215,16777215,16777215,16777215,16777215,16777215,16777215,16777215,16777215,16777215,16777215,16777215,16777215,16777215,16777215,16777215,16777215,16777215,6275299,6275299,6275299,6275299,6275299,6275299,6275299,6275299,6275299,6275299,10092543,10092543,16777215,16777215,16777215,16777215,16711680,16777215,16777215,16777215,16777215,16777215,16777215,16777215,16777215,16711680,16777215,16777215,16777215,16777215,16777215,16777215,16777215,16777215,16777215,16777215,16777215,16777215,16777215,16777215,16777215,16777215,16777215,16777215,16777215,16777215,16777215,16777215,16777215,16777215,16777215,16777215,16777215,16777215,16777215,16777215,16777215,16777215,16777215,6275299,16777215,16777215,16777215,16777215,16777215,16777215,16777215,16777215,16777215,16777215,16777215,16777215,16777215,10086143,16777215,16777215,16777215,16777215,16777215,9359529,16777215,16777215,6275299,16777215,16777215,16777215,16777215,16777215,16777215]
[16777215,16777215,5934,16777215,9359529,9359529,16777215,16777215,1137094,16777215,16777215,16777215,16777215,666680,16777215,0,16777215,16777215,16777215,16777215,666680,16777215,16777215,7434613,16777215,16777215,16777215,16777215,6275299,6275299,6275299,6275299,6275299,6275299,6275299,6275299,6275299,6275299,10092543,10092543,16777215,16777215,16777215,16777215,16711680,16777215,16777215,16777215,16777215,666680,16777215,16777215,16777215,16711680,16777215,16777215,16777215,16777215,16777215,16777215,16777215,16777215,16777215,16777215,16777215,16777215,3684410,16777215,16777215,16777215,16777215,666680,16777215,16777215,16777215,16777215,16777215,16777215,16777215,16777215,16777215,16777215,16777215,16777215,0,16777215,16777215,6275299,16777215,16777215,16777215,8421504,0,16777215,16777215,16777215,16777215,16777215,16777215,16777215,16777215,10086143,16777215,16777215,16777215,16777215,16777215,9359529,0,0,6275299,16777215,16777215,16777215,666680,16777215,16777215]
[16777215,16777215,16777215,16777215,9359529,9359529,16777215,16777215,16777215,16777215,16777215,16777215,16777215,16777215,16777215,16777215,16777215,16777215,16777215,16777215,16777215,16777215,16777215,16777215,16777215,16777215,16777215,16777215,16777215,16777215,16777215,16777215,16777215,16777215,16777215,16777215,16777215,16777215,16777215,16777215,16777215,16777215,16777215,16777215,16711680,16777215,16777215,16777215,16777215,16777215,16777215,16777215,16777215,16711680,16777215,16777215,16777215,16777215,16777215,16777215,16777215,16777215,16777215,16777215,16777215,16777215,16777215,16777215,16777215,16777215,16777215,16777215,16777215,16777215,16777215,16777215,16777215,16777215,16777215,16777215,16777215,16777215,16777215,16777215,16777215,16777215,16777215,16777215,16777215,16777215,16777215,16777215,16777215,16777215,16777215,16777215,16777215,16777215,16777215,16777215,16777215,16777215,16777215,16777215,16777215,16777215,16777215,9359529,16777215,16777215,16777215,16777215,16777215,16777215,16777215,16777215,16777215]
[16777215,16777215,16777215,16777215,9359529,9359529,16777215,16777215,16777215,16777215,16777215,16777215,16777215,16777215,16777215,16777215,16777215,16777215,16777215,16777215,16777215,16777215,16777215,16777215,16777215,16777215,16777215,16777215,0,0,0,0,0,0,0,0,0,0,0,0,16777215,16777215,16777215,16777215,16711680,16777215,16777215,16777215,16777215,16777215,16777215,16777215,16777215,16711680,16777215,16777215,16777215,16777215,16777215,16777215,16777215,16777215,16777215,16777215,16777215,16777215,16777215,16777215,16777215,16777215,16777215,16777215,16777215,16777215,16777215,16777215,16777215,16777215,16777215,16777215,16777215,16777215,16777215,16777215,16777215,16777215,16777215,16777215,16777215,16777215,16777215,16777215,16777215,16777215,16777215,16777215,16777215,16777215,16777215,16777215,16777215,16777215,16777215,16777215,16777215,16777215,16777215,9359529,16777215,16777215,0,16777215,16777215,16777215,16777215,16777215,16777215]
[16777215,16777215,16777215,16777215,9359529,9359529,16777215,16777215,16777215,16777215,16777215,16777215,16777215,16777215,16777215,16777215,16777215,16777215,16777215,16777215,16777215,16777215,16777215,16777215,16777215,16777215,16777215,16777215,16777215,16777215,16777215,16777215,16777215,16777215,16777215,16777215,16777215,16777215,16777215,16777215,16777215,16777215,16777215,16777215,16711680,16777215,16777215,16777215,16777215,16777215,16777215,16777215,16777215,16711680,16777215,16777215,16777215,16777215,16777215,16777215,16777215,16777215,16777215,16777215,16777215,16777215,16777215,16777215,16777215,16777215,16777215,16777215,16777215,16777215,16777215,16777215,16777215,16777215,16777215,16777215,16777215,16777215,16777215,16777215,16777215,16777215,16777215,16777215,16777215,16777215,16777215,16777215,16777215,16777215,16777215,16777215,16777215,16777215,16777215,16777215,16777215,16777215,16777215,16777215,16777215,16777215,16777215,9359529,16777215,16777215,16777215,16777215,16777215,16777215,16777215,16777215,16777215]
[16777215,16777215,16777215,16777215,9359529,9359529,16777215,16777215,16777215,16777215,16777215,16777215,16777215,16777215,16777215,16777215,16777215,16777215,16777215,16777215,16777215,16777215,16777215,16777215,16777215,16777215,16777215,16777215,16777215,16777215,16777215,16777215,16777215,16777215,16777215,16777215,16777215,16777215,16777215,16777215,16777215,16777215,16777215,16777215,16711680,16777215,16777215,16777215,16777215,16777215,16777215,16777215,16777215,16711680,16777215,16777215,16777215,16777215,16777215,16777215,16777215,16777215,16777215,16777215,16777215,16777215,16777215,16777215,16777215,16777215,16777215,16777215,16777215,16777215,16777215,16777215,16777215,16777215,16777215,16777215,16777215,16777215,16777215,16777215,16777215,16777215,16777215,16777215,16777215,16777215,0,16777215,16777215,16777215,16777215,16777215,16777215,16777215,16777215,16777215,16777215,16777215,16777215,16777215,16777215,16777215,16777215,9359529,16777215,16777215,16777215,16777215,16777215,16777215,16777215,16777215,16777215]
[16777215,16777215,16777215,16777215,9359529,9359529,16777215,16777215,16777215,16777215,16777215,16777215,16777215,16777215,16777215,16777215,16777215,16777215,16777215,16777215,16777215,16777215,16777215,16777215,16777215,16777215,0,16777215,16777215,16777215,16777215,16777215,16777215,16777215,16777215,16777215,16777215,16777215,16777215,16777215,16777215,16777215,16777215,16777215,16711680,16777215,16777215,16777215,16777215,16777215,16777215,16777215,16777215,16711680,16777215,16777215,16777215,16777215,16777215,16777215,16777215,16777215,16777215,16777215,16777215,16777215,16777215,16777215,16777215,16777215,16777215,16777215,16777215,16777215,16777215,16777215,16777215,16777215,16777215,16777215,16777215,16777215,16777215,16777215,16777215,16777215,16777215,16777215,16777215,16777215,16777215,16777215,16777215,16777215,16777215,16777215,16777215,16777215,16777215,16777215,16777215,16777215,16777215,16777215,16777215,16777215,16777215,9359529,16777215,16777215,16777215,16777215,16777215,16777215,16777215,16777215,16777215]
[16777215,16777215,16777215,16777215,9359529,9359529,16777215,1709849,16777215,16777215,16777215,16777215,16777215,16777215,16777215,16777215,16777215,16777215,16777215,16777215,16777215,16777215,16777215,16777215,16777215,16777215,15773696,16777215,16777215,16777215,16777215,16777215,16777215,16777215,16777215,16777215,16777215,16777215,16777215,16777215,16777215,16777215,16777215,16777215,16711680,16777215,16777215,16777215,16777215,16777215,16777215,16777215,16777215,16711680,16777215,16777215,16777215,16777215,16777215,16777215,16777215,16777215,16777215,16777215,16777215,16777215,16777215,16777215,16777215,16777215,16777215,16777215,16777215,16777215,16777215,16777215,16777215,16777215,16777215,16777215,16777215,16777215,16777215,16777215,16777215,16777215,16777215,16777215,16777215,16777215,16777215,16777215,16777215,16777215,16777215,16777215,16777215,16777215,16777215,16777215,16777215,16777215,16777215,16777215,16777215,16777215,16777215,9359529,16777215,16777215,16777215,16777215,16777215,16777215,16777215,16777215,16777215]
[16777215,16777215,16777215,16777215,9359529,9359529,16777215,1709849,16777215,16777215,16777215,16777215,16777215,16777215,16777215,16777215,0,16777215,16777215,16777215,16777215,16777215,16777215,16777215,16777215,11573124,0,16777215,16777215,16777215,16777215,16777215,16777215,16777215,16777215,16777215,16777215,16777215,16777215,16777215,16777215,16777215,16777215,16777215,16711680,16777215,16777215,16777215,16777215,16777215,16777215,16777215,16777215,16711680,16777215,16777215,16777215,16777215,16777215,16777215,16777215,16777215,16777215,16777215,3770805,16777215,16777215,16777215,16777215,16777215,16777215,16777215,16777215,16777215,16777215,16777215,16777215,16777215,16777215,16777215,16777215,16777215,16777215,16777215,16777215,16777215,16777215,16777215,16777215,16777215,7434613,16777215,16777215,16777215,16777215,16777215,16777215,16777215,16777215,16777215,16777215,16777215,16777215,16777215,16777215,16777215,16777215,9359529,16777215,16777215,16777215,16777215,16777215,16777215,16777215,16777215,16777215]
[16777215,16777215,16777215,16777215,9359529,9359529,16777215,16777215,16777215,16777215,16777215,16777215,16777215,16777215,16777215,16777215,0,16777215,16777215,16777215,16777215,16777215,16777215,16777215,16777215,11573124,16777215,16777215,16777215,16777215,16777215,16777215,16777215,16777215,16777215,16777215,16777215,16777215,16777215,16777215,16777215,16777215,16777215,16777215,16711680,204,16777215,16777215,16777215,16777215,16777215,16777215,16777215,16711680,16777215,16777215,801923,16777215,16777215,16777215,16777215,16777215,16777215,16777215,3175320,16777215,16777215,16777215,16777215,16777215,16777215,16777215,16777215,16777215,16777215,16777215,16777215,16777215,16777215,16777215,16777215,16777215,16777215,16777215,16777215,16777215,16777215,16777215,16777215,16777215,0,16777215,16777215,16777215,16777215,16777215,16777215,16777215,16777215,16777215,16777215,16777215,16777215,16777215,16777215,16777215,16777215,9359529,16777215,16777215,16777215,16777215,16777215,16777215,16777215,16777215,16777215]
[16777215,16777215,16777215,16777215,9359529,9359529,16777215,16777215,16777215,16777215,16777215,16777215,16777215,16777215,16777215,16777215,16777215,16777215,16777215,16777215,16777215,16777215,16777215,16777215,16777215,16777215,16777215,16777215,16777215,16777215,16777215,16777215,16777215,16777215,16777215,16777215,16777215,16777215,16777215,16777215,16777215,10086143,16777215,16777215,16711680,204,16777215,16777215,16777215,16777215,16777215,3368601,16777215,16711680,16777215,16777215,801923,16777215,16777215,16777215,16777215,16777215,16777215,16777215,3770805,16777215,16777215,3905232,16777215,16777215,16777215,16777215,16777215,16777215,8696052,16777215,16777215,16777215,16777215,16777215,16777215,16777215,16777215,16777215,16777215,16777215,16777215,16777215,16777215,16777215,7434613,16777215,16777215,16777215,16777215,16777215,16777215,16777215,16777215,16777215,16777215,16777215,16777215,16777215,16777215,16777215,16777215,9359529,16777215,16777215,16777215,16777215,16777215,16777215,16777215,16777215,16777215]
[16777215,16777215,16777215,16777215,9359529,9359529,16777215,5072516,16777215,16777215,16777215,16777215,16777215,16777215,16777215,16777215,16777215,15921906,15921906,16777215,16777215,16777215,16777215,16777215,0,16777215,16777215,16777215,16777215,16777215,16777215,16777215,16777215,16777215,16777215,16777215,16777215,16777215,16777215,16777215,0,10086143,16777215,16777215,65280,16777215,16777215,16777215,16777215,16777215,16777215,13158,16777215,65280,16777215,16777215,16777215,16777215,16777215,1137094,16777215,16777215,16777215,16777215,0,16777215,16777215,3905232,16777215,16777215,16777215,16777215,16777215,16777215,16777215,16777215,16777215,16777215,5935018,16777215,16777215,16777215,15921906,16777215,16777215,16777215,16777215,16777215,16777215,16777215,16777215,16777215,16777215,16777215,0,16777215,16777215,16777215,16777215,0,16777215,16777215,16777215,0,0,16777215,16777215,9359529,16777215,16777215,16777215,16777215,0,16777215,16777215,16777215,16777215]
[16777215,16777215,5934,16777215,9359529,9359529,16777215,16777215,16777215,16777215,16777215,16777215,16777215,666680,16777215,0,16777215,15921906,15921906,16777215,666680,16777215,16777215,7434613,0,16777215,16777215,16777215,16777215,16777215,16777215,16777215,16777215,16777215,16777215,16777215,16777215,16777215,16777215,16777215,0,10086143,16777215,16777215,16711680,16777215,16777215,16777215,16777215,666680,16777215,3368601,16777215,16711680,11389944,16777215,16777215,16777215,16777215,1137094,16777215,16777215,16777215,16777215,9464307,16777215,3684410,3905232,16777215,16777215,16777215,666680,16777215,16777215,16777215,16777215,16777215,16777215,5935018,16777215,16777215,16777215,15921906,16777215,16777215,16777215,16777215,16777215,16777215,16777215,16777215,16777215,16777215,16777215,0,16777215,16777215,16777215,16777215,0,16777215,16777215,16777215,0,0,16777215,16777215,9359529,16777215,16777215,16777215,16777215,0,16777215,666680,16777215,16777215]
[16777215,16777215,5934,16777215,9359529,9359529,16777215,16777215,16777215,16777215,16777215,16777215,16777215,666680,16777215,0,0,16777215,16777215,16777215,666680,16777215,16777215,7434613,16777215,11573124,16777215,16777215,16777215,16777215,16777215,16777215,16777215,16777215,16777215,16777215,16777215,16777215,16777215,16777215,0,10086143,16777215,16777215,12566463,16777215,16777215,16777215,16777215,666680,16777215,3368601,16777215,16777215,16777215,16777215,16777215,16777215,16777215,16777215,16777215,16777215,16777215,16777215,0,16777215,3684410,3905232,16777215,16777215,16777215,666680,16777215,16777215,8696052,16777215,16777215,16777215,5935018,16777215,16777215,16777215,16777215,16777215,0,16777215,16777215,16777215,16777215,16777215,16777215,16777215,0,16777215,0,16777215,16777215,16777215,16777215,16777215,16777215,16777215,16777215,0,0,16777215,16777215,9359529,0,0,16777215,16777215,16777215,16777215,666680,16777215,16777215]
[16777215,16777215,16777215,16777215,9359529,9359529,16777215,1709849,855309,16777215,16777215,16777215,16777215,16777215,16777215,16777215,0,16777215,16777215,16777215,16777215,16777215,16777215,16777215,16777215,11573124,16777215,16777215,16777215,16777215,16777215,16777215,16777215,16777215,16777215,16777215,16777215,16777215,16777215,16777215,16777215,10086143,16777215,16777215,16711680,16777215,16777215,16777215,16777215,16777215,16777215,13158,16777215,16711680,16777215,16777215,16777215,16777215,16777215,16777215,16777215,16777215,16777215,16777215,3770805,16777215,16777215,3905232,0,16777215,16777215,16777215,16777215,16777215,16777215,16777215,16777215,16777215,5935018,16777215,16777215,0,15921906,16777215,0,16777215,16777215,19816,16777215,16777215,16777215,16777215,0,16777215,16777215,16777215,36799,16777215,16777215,16777215,16777215,801923,16777215,0,0,16777215,16777215,9359529,0,0,16777215,16777215,16777215,16777215,16777215,16777215,16777215]
[16777215,16777215,0,16777215,19816,19816,16777215,1709849,16777215,16777215,16777215,16777215,1799573,0,16777215,3684410,16777215,15921906,15921906,16777215,0,16777215,16777215,5855577,0,16777215,16777215,16777215,0,0,0,0,0,0,0,0,0,0,0,0,16777215,10086143,16777215,16777215,16777215,16777215,16777215,0,16777215,0,16777215,3368601,16777215,0,11389944,16777215,16777215,16777215,16777215,1137094,16777215,16777215,16777215,16777215,3770805,16777215,204,3905232,0,16777215,16777215,0,16777215,16777215,16777215,16764057,16764057,16764057,16764057,14064512,204,0,15921906,16777215,16777215,16777215,16777215,16777215,16777215,16777215,16777215,16777215,16777215,16777215,16777215,16777215,3684410,16777215,16777215,0,16777215,16777215,16777215,0,0,16777215,16777215,19816,16777215,16777215,0,16777215,0,16777215,0,16777215,16777215]
[16777215,16777215,0,16777215,9359529,9359529,16777215,16777215,16777215,16777215,16777215,16777215,16777215,0,16777215,3684410,16777215,15921906,15921906,16777215,0,16777215,16777215,5855577,0,16777215,16777215,16777215,0,0,0,0,0,0,0,0,0,0,0,0,16777215,10086143,16777215,16777215,16777215,16777215,16777215,0,16777215,0,16777215,16777215,16777215,0,16777215,16777215,16777215,16777215,16777215,1137094,16777215,16777215,16777215,16777215,3770805,16777215,204,16777215,0,16777215,16777215,0,16777215,16777215,16777215,16777215,16777215,16777215,16777215,16777215,16777215,0,16777215,16777215,6740479,16777215,16777215,16777215,16777215,16777215,16777215,16777215,6740479,16777215,16777215,16777215,3684410,16777215,16777215,0,16777215,16777215,16777215,0,0,16777215,16777215,9359529,6740479,6740479,0,16777215,0,16777215,0,16777215,16777215]
[16777215,16777215,0,16777215,19816,19816,16777215,16777215,4891128,16777215,16777215,16777215,16777215,0,16777215,3684410,16777215,16777215,16777215,16777215,0,16777215,16777215,5855577,16777215,16777215,16777215,16777215,6275299,6275299,6275299,6275299,6275299,6275299,6275299,6275299,6275299,6275299,10092543,10092543,0,16777215,16777215,16777215,16777215,204,16777215,0,16777215,0,16777215,16777215,16777215,0,16777215,16777215,16777215,16777215,16777215,16777215,16777215,16777215,16777215,16777215,3770805,16777215,204,16777215,0,16777215,16777215,0,16777215,16777215,16777215,16764057,16764057,16764057,16764057,14064512,16777215,0,16777215,16777215,6740479,16777215,16777215,6275299,16777215,16777215,16777215,16777215,6740479,16777215,0,16777215,3684410,16777215,16777215,16777215,16777215,10086143,16777215,0,0,16777215,16777215,19816,6740479,6740479,6275299,16777215,16777215,16777215,0,16777215,16777215]
[16777215,16777215,0,16777215,9359529,9359529,16777215,16777215,4891128,16777215,16777215,16777215,666680,0,16777215,3684410,16777215,16777215,16777215,16777215,0,16777215,16777215,5855577,16777215,16777215,16777215,16777215,6275299,6275299,6275299,6275299,6275299,6275299,6275299,6275299,6275299,6275299,10092543,10092543,0,16777215,16777215,16777215,16777215,204,16777215,16777215,16777215,0,16777215,16777215,16777215,0,16777215,16777215,801923,16777215,16777215,16777215,16777215,16777215,16777215,16777215,16777215,16777215,204,16777215,0,16777215,16777215,0,16777215,16777215,16777215,16777215,16777215,16777215,16777215,16777215,16777215,0,16777215,16777215,6740479,16777215,16777215,6275299,16777215,16777215,16777215,16777215,6740479,16777215,0,16777215,16777215,16777215,16777215,16777215,16777215,10086143,16777215,16777215,16777215,16777215,16777215,9359529,6740479,6740479,6275299,16777215,16777215,16777215,0,16777215,16777215]
[16777215,16777215,16777215,16777215,9359529,9359529,16777215,16777215,801923,16777215,16777215,16777215,666680,16777215,16777215,16777215,16777215,16777215,16777215,16777215,16777215,16777215,16777215,16777215,16777215,16777215,16777215,16777215,6275299,6275299,6275299,6275299,6275299,6275299,6275299,6275299,6275299,6275299,10092543,10092543,0,16777215,16777215,16777215,16777215,16777215,16777215,16777215,16777215,801923,16777215,16777215,16777215,0,16777215,16777215,801923,16777215,16777215,16777215,16777215,16777215,16777215,16777215,16777215,16777215,204,16777215,0,16777215,16777215,16777215,16777215,16777215,16777215,16777215,16777215,16777215,16777215,16777215,204,0,16777215,16777215,6740479,16777215,16777215,6275299,16777215,16777215,16777215,8421504,6740479,16777215,0,16777215,16777215,16777215,16777215,16777215,16777215,10086143,16777215,16777215,16777215,16777215,16777215,9359529,6740479,6740479,6275299,16777215,16777215,16777215,16777215,16777215,16777215]
[16777215,16777215,5934,16777215,9359529,9359529,16777215,16777215,801923,16777215,16777215,16777215,666680,666680,16777215,0,16777215,16777215,16777215,16777215,666680,16777215,16777215,7434613,16777215,16777215,16777215,16777215,6275299,6275299,6275299,6275299,6275299,6275299,6275299,6275299,6275299,6275299,10092543,10092543,16777215,16777215,16777215,16777215,12566463,16777215,16777215,16777215,16777215,666680,16777215,16777215,16777215,16777215,16777215,16777215,16777215,16777215,16777215,16777215,16777215,16777215,16777215,16777215,16777215,16777215,3684410,16777215,16777215,16777215,16777215,666680,16777215,16777215,16777215,16777215,16777215,16777215,16777215,16777215,16777215,16777215,16777215,16777215,0,16777215,16777215,6275299,16777215,16777215,16777215,8421504,0,16777215,16777215,16777215,16777215,16777215,16777215,16777215,16777215,10086143,16777215,16777215,16777215,16777215,16777215,9359529,0,0,6275299,16777215,16777215,16777215,666680,16777215,16777215]
[16777215,16777215,5934,16777215,9359529,9359529,16777215,16777215,1137094,16777215,16777215,16777215,666680,666680,16777215,0,16777215,16777215,16777215,16777215,666680,16777215,16777215,7434613,16777215,16777215,16777215,16777215,6275299,6275299,6275299,6275299,6275299,6275299,6275299,6275299,6275299,6275299,10092543,10092543,16777215,16777215,16777215,16777215,16711680,16777215,16777215,16777215,16777215,666680,16777215,3368601,16777215,16711680,16777215,16777215,16777215,16777215,16777215,16777215,16777215,16777215,16777215,16777215,16777215,16777215,3684410,16777215,16777215,16777215,16777215,666680,16777215,16777215,16777215,16777215,16777215,16777215,16777215,16777215,16777215,16777215,16777215,16777215,0,16777215,16777215,6275299,16777215,16777215,16777215,16777215,0,16777215,16777215,16777215,16777215,16777215,16777215,16777215,16777215,10086143,16777215,16777215,16777215,16777215,16777215,9359529,0,0,6275299,16777215,16777215,16777215,666680,16777215,16777215]
[16777215,16777215,16777215,16777215,9359529,9359529,16777215,16777215,4891128,16777215,16777215,16777215,1799573,16777215,16777215,16777215,16777215,16777215,16777215,16777215,16777215,16777215,16777215,16777215,16777215,16777215,16777215,16777215,0,0,0,0,0,0,0,0,0,0,0,0,16777215,16777215,16777215,16777215,16711680,16777215,16777215,16777215,16777215,16777215,16777215,13158,16777215,16711680,16777215,16777215,16777215,16777215,16777215,16777215,16777215,16777215,16777215,16777215,16777215,16777215,16777215,16777215,16777215,16777215,16777215,16777215,16777215,16777215,16777215,16777215,16777215,16777215,16777215,16777215,16777215,16777215,16777215,16777215,16777215,16777215,16777215,6275299,16777215,16777215,16777215,8421504,16777215,16777215,16777215,16777215,16777215,16777215,16777215,16777215,16777215,10086143,16777215,16777215,16777215,16777215,16777215,9359529,16777215,16777215,0,16777215,16777215,16777215,16777215,16777215,16777215]
[16777215,16777215,16777215,16777215,9359529,9359529,16777215,16777215,16777215,16777215,16777215,16777215,16777215,16777215,16777215,16777215,16777215,16777215,16777215,16777215,16777215,16777215,16777215,16777215,16777215,16777215,16777215,16777215,0,0,0,0,0,0,0,0,0,0,0,0,16777215,16777215,16777215,16777215,16711680,16777215,16777215,16777215,16777215,16777215,16777215,16777215,16777215,16711680,16777215,16777215,16777215,16777215,16777215,16777215,16777215,16777215,16777215,16777215,16777215,16777215,16777215,16777215,16777215,16777215,16777215,16777215,16777215,16777215,16777215,16777215,16777215,16777215,16777215,16777215,16777215,16777215,16777215,16777215,16777215,16777215,16777215,16777215,16777215,16777215,16777215,16777215,16777215,16777215,16777215,16777215,16777215,16777215,16777215,16777215,16777215,16777215,16777215,16777215,16777215,16777215,16777215,9359529,16777215,16777215,0,16777215,16777215,16777215,16777215,16777215,16777215]
[16777215,16777215,16777215,16777215,9359529,9359529,16777215,16777215,16777215,16777215,16777215,16777215,16777215,16777215,16777215,16777215,16777215,16777215,16777215,16777215,16777215,16777215,16777215,16777215,16777215,16777215,16777215,16777215,16777215,16777215,16777215,16777215,16777215,16777215,16777215,16777215,16777215,16777215,16777215,16777215,16777215,16777215,16777215,16777215,16711680,16777215,16777215,16777215,16777215,16777215,16777215,16777215,16777215,16711680,16777215,16777215,16777215,16777215,16777215,16777215,16777215,16777215,16777215,16777215,16777215,16777215,16777215,16777215,16777215,16777215,16777215,16777215,16777215,16777215,16777215,16777215,16777215,16777215,16777215,16777215,16777215,16777215,16777215,16777215,16777215,16777215,16777215,16777215,16777215,16777215,16777215,16777215,16777215,16777215,16777215,16777215,16777215,16777215,16777215,16777215,16777215,16777215,16777215,16777215,16777215,16777215,16777215,9359529,16777215,16777215,16777215,16777215,16777215,16777215,16777215,16777215,16777215]
[16777215,16777215,16777215,16777215,9359529,9359529,16777215,16777215,16777215,16777215,16777215,16777215,16777215,16777215,16777215,16777215,16777215,16777215,16777215,16777215,16777215,16777215,16777215,16777215,16777215,16777215,16777215,16777215,16777215,16777215,16777215,16777215,16777215,16777215,16777215,16777215,16777215,16777215,16777215,16777215,16777215,16777215,16777215,16777215,16711680,16777215,16777215,16777215,16777215,16777215,16777215,16777215,16777215,16711680,16777215,16777215,16777215,16777215,16777215,16777215,16777215,16777215,16777215,16777215,16777215,16777215,16777215,16777215,16777215,16777215,16777215,16777215,16777215,16777215,16777215,16777215,16777215,16777215,16777215,16777215,16777215,16777215,16777215,16777215,16777215,16777215,16777215,16777215,16777215,16777215,0,16777215,16777215,16777215,16777215,16777215,16777215,16777215,16777215,16777215,16777215,16777215,16777215,16777215,16777215,16777215,16777215,9359529,16777215,16777215,16777215,16777215,16777215,16777215,16777215,16777215,16777215]
[16777215,16777215,16777215,16777215,9359529,9359529,16777215,16777215,16777215,16777215,16777215,16777215,16777215,16777215,16777215,16777215,16777215,16777215,16777215,16777215,16777215,16777215,16777215,16777215,16777215,16777215,0,16777215,16777215,16777215,16777215,16777215,16777215,16777215,16777215,16777215,16777215,16777215,16777215,16777215,16777215,16777215,16777215,16777215,16711680,16777215,16777215,16777215,16777215,16777215,16777215,16777215,16777215,16711680,16777215,16777215,16777215,16777215,16777215,16777215,16777215,16777215,16777215,16777215,16777215,16777215,16777215,16777215,16777215,16777215,16777215,16777215,16777215,16777215,16777215,16777215,16777215,16777215,16777215,16777215,16777215,16777215,16777215,16777215,16777215,16777215,16777215,16777215,16777215,16777215,0,16777215,16777215,16777215,16777215,16777215,16777215,16777215,16777215,16777215,16777215,16777215,16777215,16777215,16777215,16777215,16777215,9359529,16777215,16777215,16777215,16777215,16777215,16777215,16777215,16777215,16777215]
[16777215,16777215,16777215,16777215,9359529,9359529,16777215,1709849,16777215,16777215,16777215,16777215,16777215,16777215,16777215,16777215,16777215,16777215,16777215,16777215,16777215,16777215,16777215,16777215,16777215,16777215,5296274,16777215,16777215,16777215,16777215,16777215,16777215,16777215,16777215,16777215,16777215,16777215,16777215,16777215,16777215,16777215,16777215,16777215,16711680,16777215,16777215,16777215,16777215,16777215,16777215,16777215,16777215,16711680,16777215,16777215,16777215,16777215,16777215,16777215,16777215,16777215,16777215,16777215,16777215,16777215,16777215,16777215,16777215,16777215,16777215,16777215,16777215,16777215,16777215,16777215,16777215,16777215,16777215,16777215,16777215,16777215,16777215,16777215,16777215,16777215,16777215,16777215,16777215,16777215,7434613,16777215,16777215,16777215,16777215,16777215,16777215,16777215,16777215,16777215,16777215,16777215,16777215,16777215,16777215,16777215,16777215,9359529,16777215,16777215,16777215,16777215,16777215,16777215,16777215,16777215,16777215]
[16777215,16777215,16777215,16777215,9359529,9359529,16777215,2305859,16777215,16777215,16777215,16777215,16777215,16777215,16777215,16777215,0,16777215,16777215,16777215,16777215,16777215,16777215,16777215,16777215,11573124,5296274,16777215,16777215,16777215,16777215,16777215,16777215,16777215,16777215,16777215,16777215,16777215,16777215,16777215,16777215,16777215,16777215,16777215,16711680,16777215,16777215,16777215,16777215,16777215,16777215,13158,16777215,16711680,13224393,16777215,16777215,16777215,16777215,16777215,16777215,16777215,16777215,16777215,16777215,16777215,16777215,3905232,16777215,16777215,16777215,16777215,16777215,16777215,16777215,16777215,16777215,16777215,16777215,16777215,16777215,16777215,16777215,16777215,16777215,16777215,16777215,16777215,16777215,16777215,7434613,16777215,16777215,16777215,16777215,16777215,16777215,16777215,16777215,16777215,16777215,16777215,16777215,16777215,16777215,16777215,16777215,9359529,16777215,16777215,16777215,16777215,16777215,16777215,16777215,16777215,16777215]
[16777215,16777215,16777215,16777215,9359529,9359529,16777215,1709849,16777215,8092539,16777215,8092539,16777215,16777215,16777215,16777215,0,16777215,16777215,16777215,16777215,16777215,1137094,16777215,16777215,11573124,0,16777215,16777215,16777215,16777215,16777215,16777215,16777215,16777215,16777215,16777215,16777215,16777215,16777215,0,10086143,16777215,16777215,16711680,26367,16777215,16777215,16777215,16777215,16777215,3368601,16777215,16711680,16777215,16777215,801923,16777215,16777215,16777215,16777215,16777215,16777215,16777215,3770805,16777215,16777215,3905232,16777215,16777215,16777215,16777215,16777215,16777215,16777215,16777215,16777215,16777215,16777215,16777215,16777215,16777215,16777215,16777215,16777215,16777215,16777215,16777215,16777215,16777215,0,16777215,16777215,16777215,0,16777215,16777215,5395026,16777215,16777215,16777215,16777215,0,16777215,16777215,16777215,16777215,9359529,16777215,16777215,16777215,16777215,16777215,16777215,16777215,16777215,16777215]
[16777215,16777215,16777215,16777215,9359529,9359529,16777215,16777215,16777215,16777215,16777215,16777215,16777215,16777215,16777215,16777215,10225233,16777215,16777215,16777215,16777215,16777215,16777215,16777215,16777215,10921638,16777215,16777215,16777215,16777215,16777215,16777215,16777215,16777215,16777215,16777215,16777215,16777215,16777215,16777215,0,10086143,16777215,16777215,65280,204,16777215,16777215,16777215,16777215,16777215,3368601,16777215,65280,16777215,16777215,801923,16777215,16777215,16777215,16777215,16777215,16777215,16777215,3770805,16777215,16777215,3905232,16777215,16777215,16777215,16777215,16777215,16777215,8696052,16777215,16777215,16777215,16777215,16777215,16777215,16777215,16777215,16777215,16777215,16777215,16777215,16777215,16777215,16777215,0,16777215,16777215,16777215,0,16777215,16777215,16777215,16777215,16777215,16777215,16777215,16777215,16777215,16777215,16777215,16777215,9359529,16777215,16777215,16777215,16777215,16777215,16777215,16777215,16777215,16777215]
[16777215,16777215,16777215,16777215,9359529,9359529,16777215,5072516,16777215,16777215,16777215,16777215,16777215,16777215,16777215,16777215,10225233,10921638,10921638,16777215,16777215,16777215,16777215,16777215,0,10921638,16777215,16777215,16777215,16777215,16777215,16777215,16777215,16777215,16777215,16777215,16777215,16777215,16777215,16777215,0,10086143,16777215,16777215,16711680,204,16777215,16777215,16777215,16777215,16777215,3368601,16777215,16711680,16777215,16777215,801923,16777215,16777215,1137094,16777215,16777215,16777215,16777215,3770805,16777215,16777215,3905232,16777215,16777215,16777215,16777215,16777215,16777215,8696052,16777215,16777215,16777215,16777215,16777215,16777215,16777215,15921906,16777215,16777215,16777215,16777215,16777215,16777215,16777215,16777215,16777215,16777215,16777215,0,16777215,16777215,16777215,16777215,0,16777215,16777215,16777215,0,0,16777215,16777215,9359529,3506772,2315831,16777215,16777215,0,16777215,16777215,16777215,16777215]
[16777215,16777215,5934,16777215,192,192,16777215,16777215,16777215,16777215,16777215,16777215,16777215,666680,16777215,0,10225233,15921906,15921906,16777215,666680,16777215,16777215,7434613,16764159,10921638,16777215,16777215,16777215,16777215,16777215,16777215,16777215,16777215,16777215,16777215,16777215,16777215,16777215,16777215,14277081,10086143,16777215,16777215,16711680,16777215,16777215,16777215,16777215,666680,16777215,13158,16777215,16711680,11389944,16777215,16777215,16777215,16777215,1137094,16777215,16777215,16777215,16777215,3770805,16777215,3684410,3905232,16777215,16777215,16777215,666680,16777215,16777215,16777215,10017782,10017782,10017782,10017782,0,16777215,16777215,16777215,16777215,16777215,16777215,16777215,16777215,16777215,16777215,16777215,16777215,16777215,16777215,14277081,16777215,16777215,5395026,4210752,13224393,16777215,16777215,16777215,1137094,1137094,16777215,16777215,192,3506772,3506772,16777215,16777215,13224393,16777215,666680,16777215,16777215]
[16777215,16777215,5934,16777215,192,192,16777215,1709849,16777215,8092539,16777215,8092539,16777215,16777215,16777215,0,0,801923,0,16777215,16777215,16777215,1137094,7434613,0,11573124,16777215,16777215,16777215,16777215,16777215,16777215,16777215,16777215,16777215,16777215,16777215,16777215,16777215,16777215,0,10086143,16777215,42752,12566463,6740479,16777215,16777215,16777215,801923,16777215,3368601,16777215,16777215,11389944,16777215,16777215,16777215,16777215,0,16777215,16777215,16777215,16777215,3770805,16777215,3684410,3905232,11838,16777215,16777215,666680,16777215,11141282,8696052,10017782,10017782,10017782,10017782,0,16777215,11838,15921906,16777215,0,16777215,16777215,16777215,16777215,16777215,16777215,16777215,0,16777215,0,16777215,3684410,16777215,4210752,0,16777215,16777215,16777215,1137094,1137094,16777215,16777215,192,0,0,16777215,16777215,0,16777215,16777215,16777215,16777215]
[16777215,16777215,0,16777215,192,192,16777215,2305859,855309,16777215,16777215,16777215,16777215,0,16777215,3684410,0,801923,0,16777215,0,16777215,16777215,5855577,0,11573124,16777215,16777215,16777215,16777215,16777215,16777215,16777215,16777215,16777215,16777215,16777215,16777215,16777215,16777215,0,10086143,16777215,16777215,16777215,6740479,16777215,0,16777215,0,16777215,3368601,16777215,0,11389944,16777215,16777215,16777215,16777215,0,16777215,16777215,16777215,16777215,0,16777215,204,3905232,11838,16777215,16777215,0,16777215,16777215,8696052,10017782,10017782,10017782,10017782,0,16777215,11838,16777215,16777215,0,16777215,16777215,19816,16777215,16777215,16777215,16777215,0,16777215,0,16777215,36799,16777215,4210752,0,16777215,801923,0,0,0,16777215,16777215,192,0,0,16777215,16777215,0,16777215,0,16777215,16777215]
[16777215,16777215,0,16777215,192,192,16777215,1709849,855309,16777215,16777215,16777215,1799573,16777215,16777215,3684410,16777215,10921638,10921638,16777215,16777215,16777215,16777215,5855577,16764159,16777215,16777215,16777215,0,0,0,0,0,0,0,0,0,0,0,0,0,10086143,16777215,16777215,16777215,16777215,16777215,8421504,16777215,801923,16777215,13158,16777215,0,11389944,16777215,10086143,16777215,16777215,1137094,16777215,16777215,16777215,16777215,0,16777215,204,3905232,11838,16777215,16777215,0,16777215,16777215,16777215,10017782,10017782,10017782,10017782,0,204,11838,15921906,16777215,6740479,16777215,16777215,19816,16777215,16777215,16777215,16777215,6740479,16777215,0,16777215,36799,16777215,16777215,13224393,16777215,801923,16777215,1137094,1137094,16777215,16777215,192,6740479,6740479,0,16777215,13224393,16777215,16777215,16777215,16777215]
[16777215,16777215,0,16777215,192,192,16777215,5072516,16777215,16777215,16777215,16777215,1799573,1137094,49407,3684410,16777215,15921906,15921906,16777215,1137094,16777215,16777215,5855577,0,16777215,16777215,16777215,0,0,0,0,0,0,0,0,0,0,0,0,0,10086143,16777215,42752,16777215,204,16777215,0,16777215,801923,16777215,3368601,16777215,0,16777215,16777215,16777215,16777215,16777215,1137094,16777215,16777215,16777215,16777215,0,16777215,204,3905232,11838,16777215,16777215,0,16777215,11141282,16777215,10017782,10017782,10017782,10017782,0,204,11838,16777215,16777215,6740479,16777215,16777215,16777215,16777215,16777215,16777215,16777215,6740479,16777215,0,16777215,3684410,16777215,16777215,0,16777215,16777215,16777215,1137094,1137094,16777215,16777215,192,6740479,6740479,0,16777215,0,16777215,1137094,16777215,16777215]
[16777215,16777215,0,16777215,19816,19816,16777215,16777215,16777215,16777215,16777215,16777215,666680,6740479,16777215,3684410,16777215,801923,0,16777215,16777215,16777215,16777215,5855577,16777215,16777215,16777215,16777215,0,0,0,0,0,0,0,0,0,0,0,0,8421504,10086143,16777215,16777215,16777215,204,16777215,16777215,16777215,801923,16777215,3368601,16777215,0,16777215,16777215,801923,16777215,16777215,0,16777215,16777215,16777215,16777215,3770805,16777215,204,3905232,0,16777215,16777215,0,16777215,16777215,16777215,16764057,16764057,16764057,16764057,16764057,16777215,0,16777215,16777215,6740479,16777215,16777215,16777215,16777215,16777215,16777215,6740479,6740479,16777215,8421504,16777215,3684410,16777215,16777215,16777215,16777215,16777215,16777215,0,0,16777215,16777215,19816,6740479,6740479,0,16777215,3506772,16777215,6740479,16777215,16777215]
[16777215,16777215,0,16777215,9359529,9359529,16777215,16777215,4891128,16777215,16777215,16777215,666680,1137094,16777215,3684410,16777215,16777215,16777215,16777215,16777215,16777215,16777215,5855577,16777215,16777215,16777215,16777215,6275299,6275299,6275299,6275299,6275299,6275299,6275299,6275299,6275299,6275299,10092543,10092543,16777215,16777215,16777215,16777215,16777215,26367,16777215,16777215,16777215,801923,16777215,3368601,16777215,0,13224393,16777215,801923,16777215,16777215,16777215,16777215,16777215,16777215,16777215,3770805,16777215,204,3905232,0,16777215,16777215,0,16777215,16777215,16777215,16777215,16777215,16777215,16777215,16777215,16777215,0,16777215,16777215,6740479,16777215,16777215,6275299,16777215,16777215,16777215,6740479,6740479,16777215,8421504,16777215,3684410,16777215,16777215,16777215,16777215,10086143,16777215,16777215,16777215,16777215,16777215,9359529,6740479,6740479,6275299,16777215,3506772,16777215,1137094,16777215,16777215]
[16777215,16777215,0,16777215,9359529,9359529,16777215,16777215,801923,16777215,16777215,16777215,666680,0,16777215,3684410,16777215,16777215,16777215,16777215,0,16777215,16777215,5855577,16777215,16777215,16777215,16777215,6275299,6275299,6275299,6275299,6275299,6275299,6275299,6275299,6275299,6275299,10092543,10092543,8421504,16777215,16777215,16777215,16777215,16777215,16777215,16777215,16777215,0,16777215,16777215,16777215,0,13224393,16777215,801923,16777215,16777215,16777215,16777215,16777215,16777215,16777215,16777215,16777215,204,16777215,0,16777215,16777215,0,16777215,16777215,16777215,16777215,16777215,16777215,16777215,16777215,204,0,15134446,16777215,0,16777215,16777215,6275299,16777215,16777215,16777215,8421504,0,16777215,8421504,16777215,3684410,16777215,16777215,16777215,16777215,10086143,16777215,16777215,16777215,16777215,16777215,9359529,0,0,6275299,16777215,3506772,16777215,0,16777215,16777215]
[16777215,16777215,5934,16777215,9359529,9359529,16777215,16777215,1137094,16777215,16777215,16777215,666680,16777215,16777215,0,16777215,16777215,16777215,16777215,16777215,16777215,16777215,7434613,16777215,16777215,16777215,16777215,6275299,6275299,6275299,6275299,6275299,6275299,6275299,6275299,6275299,6275299,10092543,10092543,0,16777215,16777215,16777215,16777215,16777215,16777215,16777215,16777215,16777215,16777215,3368601,16777215,0,16777215,16777215,16777215,16777215,16777215,16777215,16777215,16777215,16777215,16777215,16777215,16777215,204,16777215,0,16777215,16777215,666680,16777215,16777215,16777215,16777215,16777215,16777215,16777215,16777215,204,0,15134446,16777215,0,16777215,16777215,6275299,16777215,16777215,16777215,8421504,0,16777215,0,16777215,16777215,16777215,16777215,16777215,16777215,10086143,16777215,16777215,16777215,16777215,16777215,9359529,0,0,6275299,16777215,16777215,16777215,16777215,16777215,16777215]
[16777215,16777215,5934,16777215,9359529,9359529,16777215,16777215,1137094,16777215,16777215,16777215,1799573,666680,16777215,0,16777215,16777215,16777215,16777215,666680,16777215,16777215,7434613,16777215,16777215,16777215,16777215,0,0,0,0,0,0,0,0,0,0,0,0,0,16777215,16777215,16777215,16777215,16777215,16777215,16777215,16777215,666680,16777215,3368601,16777215,0,16777215,16777215,16777215,16777215,16777215,16777215,16777215,16777215,16777215,16777215,16777215,16777215,204,16777215,16777215,16777215,16777215,666680,16777215,16777215,16777215,16777215,16777215,16777215,16777215,16777215,16777215,16777215,16777215,16777215,0,16777215,16777215,6275299,16777215,16777215,16777215,6740479,0,16777215,0,16777215,16777215,16777215,16777215,16777215,16777215,10086143,16777215,16777215,16777215,16777215,16777215,9359529,0,0,0,16777215,16777215,16777215,666680,16777215,16777215]
[16777215,16777215,16777215,16777215,9359529,9359529,16777215,16777215,855309,16777215,16777215,16777215,1799573,16777215,16777215,16777215,16777215,16777215,16777215,16777215,16777215,16777215,16777215,16777215,16777215,16777215,16777215,16777215,0,0,0,0,0,0,0,0,0,0,0,0,16777215,16777215,16777215,16777215,16711680,16777215,16777215,16777215,16777215,16777215,16777215,13158,16777215,16711680,16777215,16777215,16777215,16777215,16777215,16777215,16777215,16777215,16777215,16777215,16777215,16777215,16777215,16777215,16777215,16777215,16777215,16777215,16777215,16777215,16777215,16777215,16777215,16777215,16777215,16777215,16777215,16777215,16777215,16777215,16777215,16777215,16777215,6275299,16777215,16777215,16777215,8421504,16777215,16777215,16777215,16777215,16777215,16777215,16777215,16777215,16777215,801923,16777215,16777215,16777215,16777215,16777215,9359529,16777215,16777215,0,16777215,16777215,16777215,16777215,16777215,16777215]
[16777215,16777215,16777215,16777215,9359529,9359529,16777215,16777215,801923,16777215,16777215,16777215,16777215,16777215,16777215,16777215,16777215,16777215,16777215,16777215,16777215,16777215,16777215,16777215,16777215,16777215,16777215,16777215,0,0,0,0,0,0,0,0,0,0,0,0,16777215,16777215,16777215,16777215,16711680,16777215,16777215,16777215,16777215,16777215,16777215,3368601,16777215,16711680,16777215,16777215,16777215,16777215,16777215,16777215,16777215,16777215,16777215,16777215,16777215,16777215,16777215,16777215,16777215,16777215,16777215,16777215,16777215,16777215,16777215,16777215,16777215,16777215,16777215,16777215,16777215,16777215,16777215,16777215,16777215,16777215,16777215,6275299,16777215,16777215,16777215,8421504,16777215,16777215,16777215,16777215,16777215,16777215,16777215,16777215,16777215,10086143,16777215,16777215,16777215,16777215,16777215,9359529,16777215,16777215,0,16777215,16777215,16777215,16777215,16777215,16777215]
[16777215,16777215,16777215,16777215,9359529,9359529,16777215,16777215,16777215,16777215,16777215,16777215,16777215,16777215,16777215,16777215,16777215,16777215,16777215,16777215,16777215,16777215,16777215,16777215,16777215,16777215,16777215,16777215,16777215,16777215,16777215,16777215,16777215,16777215,16777215,16777215,16777215,16777215,16777215,16777215,16777215,16777215,16777215,16777215,16711680,16777215,16777215,16777215,16777215,16777215,16777215,16777215,16777215,16711680,16777215,16777215,16777215,16777215,16777215,16777215,16777215,16777215,16777215,16777215,16777215,16777215,16777215,16777215,16777215,16777215,16777215,16777215,16777215,16777215,16777215,16777215,16777215,16777215,16777215,16777215,16777215,16777215,16777215,16777215,16777215,16777215,16777215,16777215,16777215,16777215,16777215,16777215,16777215,16777215,16777215,16777215,16777215,16777215,16777215,16777215,16777215,16777215,16777215,16777215,16777215,16777215,16777215,9359529,16777215,16777215,16777215,16777215,16777215,16777215,16777215,16777215,16777215]
[16777215,16777215,16777215,16777215,9359529,9359529,16777215,16777215,16777215,16777215,16777215,16777215,16777215,16777215,16777215,16777215,16777215,16777215,16777215,16777215,16777215,16777215,16777215,16777215,16777215,16777215,16777215,16777215,16777215,16777215,16777215,16777215,16777215,16777215,16777215,16777215,16777215,16777215,16777215,16777215,16777215,16777215,16777215,16777215,16711680,16777215,16777215,16777215,16777215,16777215,16777215,16777215,16777215,16711680,16777215,16777215,16777215,16777215,16777215,16777215,16777215,16777215,16777215,16777215,16777215,16777215,16777215,16777215,16777215,16777215,16777215,16777215,16777215,16777215,16777215,16777215,16777215,16777215,16777215,16777215,16777215,16777215,16777215,16777215,16777215,16777215,16777215,16777215,16777215,16777215,16777215,16777215,16777215,16777215,16777215,16777215,16777215,16777215,16777215,16777215,16777215,16777215,16777215,16777215,16777215,16777215,16777215,9359529,16777215,16777215,16777215,16777215,16777215,16777215,16777215,16777215,16777215]
[16777215,16777215,16777215,16777215,9359529,9359529,16777215,16777215,16777215,16777215,16777215,16777215,16777215,16777215,16777215,16777215,16777215,16777215,16777215,16777215,16777215,16777215,16777215,16777215,16777215,16777215,16777215,16777215,16777215,16777215,16777215,16777215,16777215,16777215,16777215,16777215,16777215,16777215,16777215,16777215,16777215,16777215,16777215,16777215,16711680,16777215,16777215,16777215,16777215,16777215,16777215,16777215,16777215,16711680,16777215,16777215,16777215,16777215,16777215,16777215,16777215,16777215,16777215,16777215,16777215,16777215,16777215,16777215,16777215,16777215,16777215,16777215,16777215,16777215,16777215,16777215,16777215,16777215,16777215,16777215,16777215,16777215,16777215,16777215,16777215,16777215,16777215,16777215,16777215,16777215,0,16777215,16777215,16777215,16777215,16777215,16777215,16777215,16777215,16777215,16777215,16777215,16777215,16777215,16777215,16777215,16777215,9359529,16777215,16777215,16777215,16777215,16777215,16777215,16777215,16777215,16777215]
[16777215,16777215,16777215,16777215,9359529,9359529,16777215,1709849,16777215,16777215,16777215,16777215,16777215,16777215,16777215,16777215,16777215,16777215,16777215,16777215,16777215,16777215,16777215,16777215,16777215,16777215,0,16777215,16777215,16777215,16777215,16777215,16777215,16777215,16777215,16777215,16777215,16777215,16777215,16777215,0,10086143,16777215,16777215,16711680,16777215,16777215,16777215,16777215,16777215,16777215,3368601,16777215,16711680,16777215,16777215,16777215,16777215,16777215,16777215,9634006,16777215,16777215,16777215,16777215,16777215,16777215,16777215,16777215,16777215,16777215,16777215,16777215,16777215,16777215,16777215,16777215,16777215,16777215,16777215,16777215,16777215,16777215,16777215,16777215,16777215,16777215,16777215,16777215,16777215,0,16777215,16777215,16777215,0,16777215,16777215,16777215,16777215,16777215,16777215,16777215,16777215,16777215,16777215,16777215,16777215,9359529,16777215,16777215,16777215,16777215,16777215,16777215,16777215,16777215,16777215]
[16777215,16777215,16777215,16777215,9359529,9359529,16777215,2305859,16777215,16777215,16777215,16777215,16777215,16777215,16777215,16777215,0,16777215,16777215,16777215,16777215,30882,16777215,16777215,16777215,11573124,65535,16777215,16777215,16777215,16777215,16777215,16777215,16777215,16777215,16777215,16777215,16777215,16777215,16777215,0,10086143,16777215,16777215,16711680,16777215,16777215,16777215,16777215,16777215,16777215,3368601,16777215,16711680,13224393,16777215,16777215,16777215,16777215,16777215,16777215,16777215,16777215,16777215,16777215,16777215,16777215,3905232,16777215,16777215,16777215,16777215,16777215,16777215,16777215,16777215,16777215,16777215,16777215,16777215,16777215,16777215,16777215,16777215,16777215,16777215,16777215,16777215,16777215,16777215,0,16777215,16777215,16777215,0,16777215,16777215,16777215,5855577,16777215,16777215,16777215,16777215,16777215,16777215,16777215,16777215,9359529,16777215,16777215,16777215,16777215,16777215,16777215,3506772,16777215,16777215]
[16777215,16777215,16777215,16777215,9359529,9359529,16777215,2305859,16777215,8092539,16777215,16777215,16777215,16777215,16777215,16777215,0,16777215,16777215,16777215,16777215,16777215,16777215,16777215,16777215,11573124,65535,16777215,16777215,16777215,16777215,16777215,16777215,16777215,16777215,16777215,16777215,16777215,16777215,16777215,8421504,10086143,16777215,16777215,16711680,16777215,16777215,16777215,16777215,16777215,16777215,13158,16777215,16711680,13224393,16777215,16777215,16777215,16777215,16777215,16777215,16777215,16777215,16777215,16777215,16777215,16777215,3905232,16777215,16777215,16777215,16777215,16777215,16777215,16777215,16777215,16777215,16777215,16777215,16777215,16777215,16777215,16777215,16777215,16777215,16777215,16777215,16777215,16777215,16777215,0,16777215,16777215,16777215,8421504,16777215,16777215,5395026,5855577,16777215,16777215,16777215,0,16777215,16777215,16777215,16777215,9359529,3506772,3506772,16777215,16777215,16777215,16777215,3506772,16777215,16777215]
[16777215,36799,16777215,16777215,9359529,9359529,16777215,1709849,16777215,8092539,16777215,8092539,16777215,16777215,16777215,16777215,0,801923,0,65535,16777215,30882,1137094,16777215,16777215,11573124,0,16777215,16777215,16777215,16777215,16777215,16777215,16777215,16777215,16777215,16777215,16777215,16777215,16777215,0,10086143,16777215,16777215,65280,26367,16777215,16777215,16777215,16777215,36799,3368601,16777215,65280,16777215,16777215,801923,16777215,3243501,0,13408767,5395026,3289655,16777215,16777215,16777215,16777215,3905232,16777215,16777215,36799,16777215,16777215,16777215,8696052,16777215,16777215,16777215,16777215,16777215,16777215,16777215,16777215,16777215,16777215,16777215,16777215,16777215,16777215,16777215,7434613,16777215,16777215,192,0,2500134,16777215,5395026,4210752,16777215,16777215,16777215,0,16777215,16777215,3243501,16777215,9359529,3506772,3506772,16777215,192,16777215,36799,3506772,16777215,3289655]
[3688550,16777215,16777215,16777215,9359529,9359529,49407,5072516,16777215,16777215,16777215,16777215,16777215,16777215,1137094,16777215,0,801923,0,16777215,16777215,16777215,16777215,16777215,0,11573124,16777215,16777215,16777215,16777215,16777215,16777215,16777215,16777215,16777215,16777215,16777215,16777215,16777215,16777215,14277081,10086143,16777215,16777215,16711680,204,16777215,16777215,16777215,16777215,16777215,3368601,16777215,16711680,11389944,16777215,801923,16777215,16777215,0,16777215,16777215,16777215,16777215,0,16777215,16777215,3905232,16777215,16777215,16777215,16777215,16777215,16777215,8696052,16777215,16777215,16777215,16777215,16777215,16777215,16777215,15921906,16777215,16777215,16777215,16777215,16777215,16777215,16777215,7434613,16777215,16777215,16777215,14277081,16777215,3684410,16777215,4210752,0,16777215,16777215,0,0,0,16777215,16777215,9359529,3506772,2315831,16777215,16777215,0,16777215,3506772,16777215,16777215]
[16777215,16777215,0,16777215,5935018,5935018,16777215,1709849,16777215,16777215,16777215,16777215,16777215,0,16777215,3684410,0,15921906,15921906,16777215,0,16777215,16777215,5855577,16776960,11573124,16777215,16777215,16777215,16777215,16777215,16777215,16777215,16777215,16777215,16777215,16777215,16777215,16777215,16777215,14277081,10086143,16777215,16777215,16777215,6740479,16777215,16777215,16777215,0,16777215,3368601,16777215,0,11389944,16777215,16777215,16777215,16777215,1137094,16777215,16777215,16777215,16777215,11447982,16777215,0,3905232,11838,16777215,16777215,0,16777215,16777215,3684410,16764057,16764057,16764057,16764057,13005646,16777215,11838,16777215,16777215,0,16777215,16777215,16777215,16777215,16777215,16777215,16777215,0,16777215,14277081,16777215,3684410,5395026,5287936,13224393,16777215,16777215,0,1137094,1137094,16777215,16777215,5935018,3506772,3506772,16777215,16777215,13224393,16777215,0,16777215,16777215]
[3688550,36799,0,16777215,19816,19816,16777215,2305859,16777215,8092539,16777215,8092539,16777215,16777215,16777215,3684410,0,801923,0,3381555,16777215,16777215,1137094,5855577,16764159,11573124,16777215,16777215,16777215,16777215,16777215,16777215,16777215,16777215,16777215,16777215,16777215,16777215,16777215,16777215,14277081,10086143,16777215,4016795,16777215,6740479,16777215,0,16777215,16777215,36799,3368601,16777215,0,11389944,16777215,16777215,16777215,3243501,0,13408767,5395026,3289655,16777215,11447982,16777215,0,3905232,11838,16777215,36799,0,16777215,977128,8696052,16764057,16764057,16764057,16764057,13005646,16777215,11838,16777215,16777215,0,16777215,16777215,16777215,16777215,16777215,16777215,16777215,0,192,14277081,2500134,3684410,5395026,5296274,5855577,16777215,16777215,0,1137094,1137094,3243501,16777215,19816,0,0,16777215,192,5855577,36799,16777215,16777215,3289655]
[16777215,16777215,0,16777215,192,192,49407,2305859,855309,16777215,16777215,16777215,16777215,0,16777215,3684410,0,15921906,15921906,16777215,0,16777215,16777215,5855577,10086143,11573124,16777215,16777215,16777215,16777215,16777215,16777215,16777215,16777215,16777215,16777215,16777215,16777215,16777215,16777215,16777215,10086143,16777215,4016795,16777215,6740479,16777215,8421504,16777215,0,16777215,3368601,16777215,0,11389944,16777215,10086143,16777215,16777215,1137094,16777215,16777215,16777215,16777215,0,16777215,204,3905232,11838,16777215,16777215,0,16777215,977128,8696052,10017782,5935018,10017782,5935018,3561320,16777215,11838,16777215,16777215,0,16777215,16777215,19816,16777215,16777215,16777215,16777215,0,16777215,14277081,16777215,36799,16777215,5296274,13224393,16777215,801923,0,0,0,16777215,16777215,192,0,0,16777215,16777215,13224393,16777215,0,16777215,16777215]
[16777215,16777215,11352,16777215,192,192,16777215,1709849,855309,16777215,16777215,16777215,1799573,49407,49407,0,10225233,15921906,15921906,16777215,49407,16777215,16777215,5855577,10086143,10921638,16777215,16777215,0,0,0,0,0,0,0,0,0,0,0,0,14277081,10086143,16777215,4016795,12566463,6740479,16777215,855309,16777215,801923,16777215,3368601,16777215,16777215,11389944,16777215,16777215,16777215,16777215,1137094,16777215,16777215,16777215,16777215,0,16777215,204,3905232,11838,16777215,16777215,14412,16777215,977128,3684410,10017782,10017782,10017782,5935018,0,204,11838,16777215,16777215,6740479,16777215,16777215,19816,16777215,16777215,16777215,16777215,6740479,16777215,14277081,16777215,36799,16777215,4210752,5855577,16777215,801923,0,1137094,1137094,16777215,16777215,192,6740479,6740479,0,16777215,5855577,16777215,49407,16777215,16777215]
[16777215,16777215,0,16777215,19816,19816,16777215,8562637,855309,16777215,16777215,16777215,666680,6740479,49407,3684410,16777215,15921906,15921906,16777215,16777215,16777215,16777215,5855577,16776960,16777215,16777215,16777215,0,0,0,0,0,0,0,0,0,0,0,0,14277081,10086143,5395026,42752,12566463,204,36799,8421504,16777215,16777215,16777215,3368601,16777215,16777215,11389944,16777215,16777215,16777215,16777215,1137094,16777215,16777215,16777215,16777215,0,16777215,204,3905232,11838,16777215,16777215,0,16777215,11141282,16777215,16764057,16764057,16764057,16764057,13005646,204,11838,15921906,36799,6740479,16777215,16777215,19816,16777215,16777215,16777215,16777215,6740479,16777215,14277081,16777215,36799,16777215,4210752,13224393,16777215,801923,16777215,1137094,1137094,16777215,16777215,19816,6740479,6740479,0,16777215,13224393,16777215,6740479,16777215,16777215]
[16777215,16777215,11352,16777215,19816,11892015,16777215,5072516,1137094,16777215,16777215,16777215,666680,1137094,16777215,0,16777215,801923,0,16777215,16777215,16777215,16777215,5855577,0,16777215,0,16777215,0,0,0,0,0,0,0,0,0,0,0,0,0,10086143,16777215,16777215,16777215,26367,16777215,0,16777215,801923,16777215,3368601,16777215,0,13224393,16777215,801923,16777215,16777215,0,16777215,16777215,16777215,16777215,3770805,16777215,204,3905232,11838,16777215,16777215,14412,16777215,16777215,16777215,16764057,16764057,11854022,16764057,13005646,16777215,11838,16777215,16777215,13158,16777215,16777215,6275299,16777215,16777215,16777215,8092539,5193523,16777215,0,16777215,36799,16777215,4210752,0,16777215,10086143,16777215,0,0,16777215,16777215,11892015,5193523,13158,0,16777215,3506772,16777215,1137094,16777215,16777215]
[16777215,16777215,0,16777215,192,192,16777215,16777215,4891128,16777215,16777215,16777215,2199221,6740479,16777215,3684410,16777215,801923,0,16777215,16777215,16777215,16777215,5855577,0,16777215,0,16777215,6275299,6275299,6275299,6275299,6275299,6275299,6275299,6275299,6275299,6275299,10092543,10092543,16777215,10086143,16777215,16777215,16777215,26367,16777215,0,16777215,801923,16777215,3368601,16777215,0,13224393,16777215,801923,16777215,16777215,0,16777215,16777215,16777215,16777215,3770805,16777215,204,3905232,0,16777215,16777215,0,16777215,16777215,16777215,10017782,5935018,10017782,10017782,3561320,204,0,15134446,16777215,13158,16777215,16777215,6275299,16777215,16777215,16777215,8092539,5193523,16777215,8421504,16777215,36799,16777215,16777215,0,16777215,10086143,16777215,16777215,16777215,16777215,16777215,192,5193523,13158,6275299,16777215,3506772,16777215,6740479,16777215,16777215]
[16777215,16777215,11352,16777215,192,192,16777215,16777215,801923,16777215,16777215,16777215,2199221,16777215,16777215,0,16777215,16777215,16777215,16777215,16777215,16777215,16777215,5855577,16777215,16777215,16777215,16777215,6275299,6275299,6275299,6275299,6275299,6275299,6275299,6275299,6275299,6275299,10092543,10092543,16777215,10086143,5395026,16777215,16777215,16777215,36799,0,16777215,801923,16777215,3368601,16777215,0,16777215,16777215,16777215,16777215,16777215,16777215,16777215,16777215,16777215,16777215,3770805,16777215,204,3905232,0,16777215,16777215,14412,16777215,16777215,16777215,10017782,10017782,10017782,10017782,0,204,0,15134446,36799,13158,16777215,16777215,6275299,16777215,16777215,16777215,8092539,5193523,16777215,8421504,16777215,3684410,16777215,16777215,16777215,16777215,10086143,16777215,16777215,16777215,16777215,16777215,192,5193523,13158,6275299,16777215,9359529,16777215,16777215,16777215,16777215]
[16777215,16777215,11352,16777215,9359529,9359529,10086143,16777215,1137094,16777215,16777215,16777215,2199221,14412,16777215,3684410,16777215,16777215,16777215,16777215,14412,16777215,16777215,5855577,16777215,16777215,16777215,16777215,6275299,6275299,6275299,6275299,6275299,6275299,6275299,6275299,6275299,6275299,10092543,10092543,8421504,16777215,16777215,16777215,16777215,16777215,16777215,16777215,16777215,14412,16777215,3368601,16777215,0,16777215,16777215,16777215,16777215,16777215,16777215,16777215,16777215,16777215,16777215,16777215,16777215,204,3905232,0,16777215,16777215,14412,16777215,16777215,16777215,16777215,16777215,16777215,10017782,16777215,204,0,16777215,16777215,13158,16777215,16777215,6275299,16777215,16777215,16777215,8092539,5193523,16777215,8421504,16777215,3684410,16777215,16777215,16777215,16777215,10086143,16777215,16777215,16777215,16777215,16777215,9359529,5193523,13158,6275299,16777215,3506772,16777215,14412,16777215,16777215]
[16777215,16777215,16777215,16777215,9359529,9359529,16777215,16777215,855309,16777215,16777215,16777215,1799573,16777215,16777215,16777215,16777215,16777215,16777215,16777215,16777215,16777215,16777215,5855577,16777215,16777215,16777215,16777215,0,0,0,0,0,0,0,0,0,0,0,0,8421504,16777215,16777215,16777215,16777215,16777215,16777215,16777215,16777215,16777215,16777215,3368601,16777215,0,16777215,16777215,16777215,16777215,16777215,16777215,16777215,16777215,16777215,16777215,16777215,16777215,204,3905232,0,16777215,16777215,16777215,16777215,16777215,16777215,16777215,16777215,16777215,16777215,16777215,16777215,0,15134446,16777215,0,16777215,16777215,6275299,16777215,16777215,16777215,8092539,0,16777215,8421504,16777215,16777215,16777215,16777215,16777215,16777215,801923,16777215,16777215,16777215,16777215,16777215,9359529,0,0,0,16777215,16777215,16777215,16777215,16777215,16777215]
[16777215,16777215,16777215,16777215,9359529,9359529,16777215,16777215,855309,16777215,16777215,16777215,1799573,16777215,16777215,16777215,16777215,16777215,16777215,16777215,16777215,16777215,16777215,16777215,16777215,16777215,16777215,16777215,0,0,0,0,0,0,0,0,0,0,0,0,0,16777215,16777215,16777215,16711680,16777215,16777215,16777215,16777215,16777215,16777215,3368601,16777215,16711680,16777215,16777215,16777215,16777215,16777215,16777215,16777215,16777215,16777215,16777215,16777215,16777215,16777215,3905232,16777215,16777215,16777215,16777215,16777215,16777215,16777215,16777215,16777215,16777215,16777215,16777215,16777215,16777215,15134446,16777215,6740479,16777215,16777215,19816,16777215,16777215,16777215,8092539,6740479,16777215,0,16777215,16777215,16777215,16777215,16777215,16777215,801923,16777215,16777215,16777215,16777215,16777215,9359529,6740479,6740479,0,16777215,16777215,16777215,16777215,16777215,16777215]
[16777215,16777215,16777215,16777215,9359529,9359529,16777215,16777215,801923,16777215,16777215,16777215,16777215,16777215,16777215,16777215,16777215,16777215,16777215,16777215,16777215,16777215,16777215,16777215,16777215,16777215,16777215,16777215,0,0,0,0,0,0,0,0,0,0,0,0,16777215,16777215,16777215,16777215,16711680,16777215,16777215,16777215,16777215,16777215,16777215,3368601,16777215,16711680,16777215,16777215,16777215,16777215,16777215,16777215,16777215,16777215,16777215,16777215,16777215,16777215,16777215,16777215,16777215,16777215,16777215,16777215,16777215,16777215,16777215,16777215,16777215,16777215,16777215,16777215,16777215,16777215,16777215,16777215,16777215,16777215,16777215,6275299,16777215,16777215,16777215,8421504,16777215,16777215,16777215,16777215,16777215,16777215,16777215,16777215,16777215,10086143,16777215,16777215,16777215,16777215,16777215,9359529,16777215,16777215,0,16777215,16777215,16777215,16777215,16777215,16777215]
[16777215,16777215,16777215,16777215,9359529,9359529,16777215,16777215,16777215,16777215,16777215,16777215,16777215,16777215,16777215,16777215,16777215,16777215,16777215,16777215,16777215,16777215,16777215,16777215,16777215,16777215,16777215,16777215,16777215,16777215,16777215,16777215,16777215,16777215,16777215,16777215,16777215,16777215,16777215,16777215,16777215,16777215,16777215,16777215,16711680,16777215,16777215,16777215,16777215,16777215,16777215,3368601,16777215,16711680,16777215,16777215,16777215,16777215,16777215,16777215,16777215,16777215,16777215,16777215,16777215,16777215,16777215,16777215,16777215,16777215,16777215,16777215,16777215,16777215,16777215,16777215,16777215,16777215,16777215,16777215,16777215,16777215,16777215,16777215,16777215,16777215,16777215,16777215,16777215,16777215,16777215,6740479,16777215,16777215,16777215,16777215,16777215,16777215,16777215,16777215,16777215,16777215,16777215,16777215,16777215,16777215,16777215,9359529,16777215,16777215,16777215,16777215,16777215,16777215,16777215,16777215,16777215]
[16777215,16777215,16777215,16777215,9359529,9359529,16777215,16777215,16777215,16777215,16777215,16777215,16777215,16777215,16777215,16777215,16777215,16777215,16777215,16777215,16777215,16777215,16777215,16777215,16777215,16777215,16777215,16777215,16777215,16777215,16777215,16777215,16777215,16777215,16777215,16777215,16777215,16777215,16777215,16777215,16777215,16777215,16777215,16777215,16711680,16777215,16777215,16777215,16777215,16777215,16777215,16777215,16777215,16711680,16777215,16777215,16777215,16777215,16777215,16777215,16777215,16777215,16777215,16777215,16777215,16777215,16777215,16777215,16777215,16777215,16777215,16777215,16777215,16777215,16777215,16777215,16777215,16777215,16777215,16777215,16777215,16777215,16777215,16777215,16777215,16777215,16777215,16777215,16777215,16777215,16777215,16777215,16777215,16777215,16777215,16777215,16777215,16777215,16777215,16777215,16777215,16777215,16777215,16777215,16777215,16777215,16777215,9359529,16777215,16777215,16777215,16777215,16777215,16777215,16777215,16777215,16777215]
[16777215,16777215,16777215,16777215,9359529,9359529,16777215,16777215,16777215,16777215,16777215,16777215,16777215,16777215,16777215,16777215,16777215,16777215,16777215,16777215,16777215,16777215,16777215,16777215,16777215,16777215,16777215,16777215,16777215,16777215,16777215,16777215,16777215,16777215,16777215,16777215,16777215,16777215,16777215,16777215,0,16777215,16777215,16777215,16711680,16777215,16777215,16777215,16777215,16777215,16777215,16777215,16777215,16711680,16777215,16777215,16777215,16777215,16777215,16777215,16777215,16777215,16777215,16777215,16777215,16777215,16777215,16777215,16777215,16777215,16777215,16777215,16777215,16777215,16777215,16777215,16777215,16777215,16777215,16777215,16777215,16777215,16777215,16777215,16777215,16777215,16777215,16777215,16777215,16777215,7434613,16777215,16777215,16777215,0,16777215,16777215,16777215,5855577,16777215,16777215,16777215,16777215,16777215,16777215,16777215,16777215,9359529,16777215,16777215,16777215,16777215,16777215,16777215,3506772,16777215,16777215]
[16777215,16777215,16777215,16777215,9359529,9359529,16777215,16777215,16777215,16777215,16777215,16777215,16777215,16777215,16777215,16777215,0,16777215,16777215,16777215,16777215,16777215,16777215,16777215,16777215,11573124,0,16777215,16777215,16777215,16777215,16777215,16777215,16777215,16777215,16777215,16777215,16777215,16777215,16777215,8421504,16777215,16777215,16777215,16711680,16777215,16777215,16777215,16777215,16777215,16777215,13158,16777215,16711680,16777215,16777215,16777215,16777215,16777215,16777215,9634006,16777215,16777215,16777215,16777215,16777215,16777215,3905232,16777215,16777215,16777215,16777215,16777215,16777215,16777215,16777215,16777215,16777215,16777215,16777215,16777215,16777215,16777215,16777215,16777215,16777215,16777215,16777215,16777215,16777215,7434613,16777215,16777215,16777215,8421504,16777215,16777215,16777215,5855577,16777215,16777215,16777215,16777215,16777215,16777215,16777215,16777215,9359529,16777215,16777215,16777215,16777215,16777215,16777215,3506772,16777215,16777215]
[16777215,16777215,16777215,16777215,9359529,9359529,16777215,2305859,16777215,16777215,16777215,16777215,16777215,16777215,16777215,16777215,0,16777215,16777215,16777215,16777215,30882,16777215,16777215,16777215,11573124,49407,16777215,16777215,16777215,16777215,16777215,16777215,16777215,16777215,16777215,16777215,16777215,16777215,16777215,8421504,16777215,16777215,16777215,16711680,16777215,16777215,16777215,16777215,16777215,16777215,3368601,16777215,16711680,16777215,16777215,16777215,16777215,16777215,16777215,9634006,16777215,16777215,16777215,16777215,16777215,16777215,3905232,16777215,16777215,16777215,16777215,255,16777215,16777215,16777215,16777215,16777215,16777215,16777215,16777215,16777215,16777215,16777215,16777215,16777215,7881510,16777215,16777215,16777215,7434613,16777215,16777215,16777215,8421504,16777215,16777215,16777215,5287936,16777215,16777215,16777215,16777215,16777215,16777215,16777215,16777215,9359529,3506772,2315831,16777215,16777215,16777215,16777215,3506772,16777215,16777215]
[16777215,16777215,16777215,192,9359529,9359529,16777215,5072516,16777215,16777215,0,16777215,16777215,16777215,16777215,16777215,0,16777215,16777215,16777215,16777215,16777215,16777215,16777215,16777215,11573124,49407,16777215,16777215,16777215,16777215,16777215,16777215,16777215,16777215,16777215,16777215,16777215,16777215,16777215,8421504,0,16777215,16777215,16711680,16777215,16777215,16777215,16777215,16777215,16777215,3368601,5395026,16711680,13224393,16777215,16777215,3243501,16777215,16777215,16777215,16777215,16777215,16777215,16777215,16777215,16777215,3905232,16777215,16777215,16777215,16777215,255,16777215,8696052,16777215,16777215,16777215,16777215,16777215,16777215,16777215,16777215,16777215,16777215,16777215,7881510,16777215,16777215,16777215,7434613,16777215,16777215,16777215,8421504,16777215,16777215,5395026,5287936,16777215,16777215,16777215,0,16777215,16777215,16777215,0,9359529,3506772,3506772,16777215,16777215,16777215,16777215,3506772,192,16777215]
[16777215,36799,16777215,16777215,9359529,9359529,16777215,5072516,16777215,8092539,16777215,8092539,16777215,16777215,1137094,16777215,0,801923,0,65535,16777215,30882,1137094,16777215,0,11573124,255,16777215,16777215,16777215,16777215,16777215,16777215,16777215,16777215,16777215,16777215,16777215,16777215,16777215,0,0,16777215,16777215,65280,16777215,16777215,16777215,16777215,16777215,36799,13158,16777215,65280,13224393,16777215,801923,16777215,3243501,0,13408767,5395026,3289655,16777215,0,16777215,16777215,3905232,16777215,16777215,36799,16777215,255,16777215,8696052,16777215,16777215,16777215,16777215,16777215,16777215,16777215,15921906,16777215,16777215,16777215,7881510,16777215,16777215,16777215,7434613,16777215,16777215,192,0,2500134,16777215,5395026,0,0,16777215,16777215,1137094,16777215,16777215,3243501,16777215,9359529,2315831,3506772,16777215,192,0,36799,3506772,16777215,3289655]
[1842988,36799,0,192,5935018,5935018,49407,5263191,16777215,8092539,0,8092539,16777215,0,1137094,3684410,0,15921906,15921906,5296274,0,16777215,1137094,5855577,16776960,11573124,0,16777215,16777215,16777215,16777215,16777215,16777215,16777215,16777215,16777215,16777215,16777215,16777215,16777215,14277081,11854022,16777215,16777215,16777215,204,16777215,16777215,16777215,0,36799,3368601,5395026,0,13224393,16777215,801923,3243501,3243501,1137094,13408767,5395026,3289655,16777215,11447982,16777215,0,3905232,16777215,15921906,36799,0,255,16777215,3684410,16764057,16764057,16764057,16764057,14726304,16777215,16777215,16777215,16777215,6740479,16777215,7881510,16777215,4210752,16777215,7434613,16777215,6740479,192,14277081,2500134,16777215,16777215,255,13224393,16777215,16777215,1137094,0,0,3243501,0,5935018,3506772,2315831,16777215,192,13224393,36799,0,192,3289655]
[1842988,16777215,0,16777215,5935018,5935018,16777215,5072516,16777215,16777215,16777215,16777215,16777215,16777215,1137094,3684410,0,15921906,15921906,16777215,16777215,16777215,16777215,5855577,16777215,11573124,0,16777215,16777215,16777215,16777215,16777215,16777215,16777215,16777215,16777215,16777215,16777215,16777215,16777215,14277081,14277081,16777215,42752,16777215,204,16777215,855309,16777215,801923,16777215,16777215,16777215,0,13224393,16777215,10086143,16777215,16777215,1137094,16777215,16777215,16777215,16777215,15123099,16777215,0,16777215,11838,16777215,16777215,0,16777215,11141282,3684410,16764057,16764057,16764057,16764057,14726304,16777215,11838,16777215,16777215,0,16777215,16777215,16777215,16777215,16777215,7434613,16777215,0,16777215,14277081,16777215,3684410,5395026,5287936,16777215,16777215,16777215,0,1137094,1137094,16777215,16777215,5935018,3506772,3506772,3506772,16777215,16777215,16777215,16777215,16777215,16777215]
[1842988,36799,0,16777215,19816,19816,16777215,5072516,16777215,8092539,16777215,10921638,16777215,0,1137094,3684410,0,15921906,15921906,3381555,0,16777215,1137094,5855577,16777215,11573124,0,16777215,16777215,16777215,16777215,16777215,16777215,16777215,16777215,16777215,16777215,16777215,16777215,16777215,14277081,9359529,16777215,4016795,16777215,204,16777215,855309,16777215,0,36799,13158,16777215,0,13224393,16777215,10086143,16777215,3243501,1137094,13408767,5395026,3289655,16777215,11447982,16777215,0,4296113,11838,15921906,36799,0,16777215,977128,8696052,16764057,16764057,16764057,16764057,14726304,16777215,11838,16777215,16777215,0,16777215,16777215,16777215,4210752,16777215,16777215,16777215,0,192,14277081,2500134,36799,5395026,5296274,16777215,16777215,16777215,1137094,1137094,1137094,3243501,16777215,19816,0,0,3506772,192,16777215,36799,0,16777215,3289655]
[3688550,36799,11352,16777215,192,192,16777215,1709849,10086143,8092539,16777215,8092539,666680,16777215,49407,0,0,15921906,15921906,15123099,16777215,16777215,1137094,5855577,16764159,11573124,0,16777215,6275299,6275299,6275299,6275299,6275299,6275299,6275299,6275299,6275299,6275299,10092543,10092543,16777215,11854022,16777215,4016795,16777215,6740479,16777215,8421504,16777215,801923,36799,13158,16777215,0,13224393,16777215,10086143,16777215,3243501,1137094,13408767,5395026,3289655,16777215,11447982,16777215,10921638,4296113,5855577,16777215,36799,14412,16777215,977128,8696052,10017782,10017782,10017782,10017782,0,0,5855577,16777215,16777215,6740479,16777215,16777215,6275299,16777215,16777215,16777215,16777215,6740479,192,14277081,2500134,36799,5395026,5296274,13224393,16777215,10086143,1137094,1137094,1137094,3243501,16777215,192,6740479,6740479,6275299,192,13224393,36799,16777215,16777215,3289655]
[16777215,16777215,11352,16777215,19816,19816,49407,14083051,855309,16777215,16777215,16777215,666680,6740479,49407,0,0,15921906,0,16777215,16777215,16777215,16777215,5855577,16764159,11573124,0,16777215,6275299,6275299,6275299,6275299,6275299,6275299,6275299,6275299,6275299,6275299,10092543,10092543,16777215,3506772,5395026,42752,12566463,204,36799,855309,16777215,16777215,16777215,0,16777215,16777215,13224393,16777215,10086143,16777215,16777215,1137094,16777215,16777215,16777215,16777215,0,16777215,10921638,1589611,11838,16777215,16777215,14412,16777215,11141282,3684410,16764057,5935018,16764057,16764057,3561320,204,11838,16777215,36799,13158,16777215,16777215,19816,16777215,16777215,16777215,16777215,5193523,16777215,14277081,16777215,36799,16777215,5296274,13224393,16777215,801923,0,1137094,1137094,3506772,16777215,19816,5193523,13158,6275299,3506772,13224393,3506772,6740479,16777215,3506772]
[16777215,16777215,11352,16777215,19816,11892015,16777215,5263191,1137094,16777215,16777215,16777215,666680,6740479,16777215,0,10225233,15921906,15921906,16777215,16777215,16777215,16777215,5855577,10086143,10921638,0,16777215,6275299,6275299,6275299,6275299,6275299,6275299,6275299,6275299,6275299,6275299,10092543,10092543,14277081,11854022,5395026,42752,12566463,204,36799,8421504,16777215,16777215,16777215,0,16777215,16777215,13224393,16777215,10086143,16777215,16777215,1137094,16777215,16777215,16777215,16777215,0,16777215,10921638,1589611,11838,16777215,16777215,14412,16777215,11141282,3684410,16764057,16764057,11854022,16764057,14726304,204,11838,16777215,36799,13158,16777215,16777215,6275299,16777215,16777215,16777215,16777215,5193523,16777215,14277081,16777215,36799,16777215,5296274,5855577,16777215,10086143,0,1137094,1137094,3506772,16777215,11892015,5193523,13158,6275299,3506772,5855577,3506772,6740479,16777215,3506772]
[16777215,16777215,11352,16777215,19816,19816,16777215,8562637,801923,16777215,16777215,16777215,666680,6740479,16777215,0,10225233,15921906,15921906,16777215,16777215,16777215,16777215,5855577,10086143,10921638,15652797,16777215,16728,1281739,16728,15773696,12611584,10498160,10925084,9465920,4525507,1424208,13382400,16764057,12566463,5296274,16777215,4016795,12566463,204,16777215,855309,16777215,16777215,16777215,13158,16777215,16777215,11389944,16777215,801923,16777215,16777215,1137094,16777215,16777215,16777215,16777215,3770805,16777215,10921638,4296113,11838,16777215,16777215,14412,16777215,977128,3684410,16764057,5935018,16764057,16764057,3561320,0,11838,15134446,16777215,13158,16777215,16777215,6275299,16777215,16777215,16777215,8092539,5193523,16777215,12566463,16777215,36799,16777215,5287936,13224393,16777215,10086143,0,0,0,16777215,16777215,19816,5193523,13158,1424208,2315831,13224393,16777215,6740479,16777215,16777215]
[16777215,16777215,11352,16777215,192,192,16777215,5072516,2500134,16777215,16777215,16777215,2199221,6740479,49407,0,16777215,801923,0,16777215,16777215,16777215,16777215,5855577,0,16777215,15652797,16777215,16728,1281739,16728,15773696,12611584,10498160,10925084,9465920,4525507,1424208,13382400,16764057,0,5296274,5395026,16777215,12566463,6740479,36799,0,16777215,801923,16777215,13158,16777215,16777215,13224393,16777215,801923,16777215,16777215,0,16777215,16777215,16777215,16777215,3175320,16777215,204,4296113,11838,16777215,16777215,14412,16777215,16777215,16777215,10017782,10017782,10017782,5935018,0,204,11838,15134446,36799,13158,16777215,16777215,1799573,16777215,16777215,16777215,8092539,5193523,16777215,0,16777215,36799,16777215,4210752,0,16777215,1137094,0,0,0,16777215,16777215,192,5193523,13158,1424208,16777215,3506772,16777215,6740479,16777215,16777215]
[16777215,16777215,11352,16777215,192,192,24704,16777215,1137094,16777215,16777215,16777215,2199221,16777215,49407,0,16777215,801923,0,16777215,16777215,16777215,16777215,5855577,16777215,16777215,0,16777215,16728,1281739,16728,15773696,12611584,10498160,10925084,9465920,4525507,1424208,13382400,16764057,8421504,16777215,5395026,16777215,12566463,16777215,36799,0,16777215,16777215,16777215,13158,16777215,16777215,16777215,16777215,16777215,16777215,16777215,0,16777215,16777215,16777215,16777215,3770805,16777215,204,4296113,0,16777215,16777215,14412,16777215,16777215,16777215,10017782,10017782,10017782,5935018,0,204,0,16777215,36799,13158,16777215,16777215,1799573,16777215,16777215,16777215,8092539,5193523,16777215,8421504,16777215,36799,16777215,16777215,16777215,16777215,10086143,0,0,0,16777215,16777215,192,5193523,13158,1424208,16777215,3506772,16777215,16777215,16777215,16777215]
[16777215,16777215,11352,16777215,9359529,9359529,24704,16777215,2500134,16777215,16777215,16777215,2199221,14412,16777215,0,16777215,801923,0,16777215,14412,16777215,16777215,5855577,16777215,16777215,16777215,16777215,16728,1281739,16728,15773696,12611584,10498160,10925084,9465920,4525507,1424208,13382400,16764057,16777215,16777215,16777215,16777215,16777215,16777215,16777215,16777215,16777215,14412,16777215,0,16777215,0,16777215,16777215,16777215,16777215,16777215,0,16777215,16777215,16777215,16777215,3770805,16777215,204,4296113,0,16777215,16777215,14412,16777215,16777215,16777215,16777215,16777215,16777215,5935018,16777215,16777215,0,15134446,16777215,13158,16777215,16777215,1799573,16777215,16777215,16777215,8092539,5193523,16777215,8421504,16777215,3684410,16777215,16777215,16777215,16777215,1137094,0,0,0,16777215,16777215,9359529,5193523,13158,1424208,16777215,3506772,16777215,14412,16777215,16777215]
[16777215,16777215,16777215,16777215,9359529,9359529,10086143,16777215,855309,16777215,16777215,16777215,1799573,16777215,16777215,16777215,16777215,16777215,16777215,16777215,16777215,16777215,16777215,5855577,16777215,16777215,16777215,16777215,16728,1281739,16728,15773696,12611584,10498160,10925084,9465920,4525507,1424208,13382400,16764057,8421504,16777215,16777215,16777215,16777215,16777215,16777215,16777215,16777215,16777215,16777215,13158,16777215,0,16777215,16777215,16777215,16777215,16777215,16777215,16777215,16777215,16777215,16777215,16777215,16777215,204,4296113,0,16777215,16777215,16777215,16777215,16777215,16777215,16777215,16777215,16777215,5935018,16777215,16777215,0,15134446,16777215,13158,16777215,16777215,19816,16777215,16777215,16777215,8092539,5193523,16777215,8421504,16777215,3684410,16777215,16777215,16777215,16777215,801923,16777215,0,0,16777215,16777215,9359529,5193523,13158,1424208,16777215,3506772,16777215,16777215,16777215,16777215]
[16777215,16777215,16777215,16777215,9359529,9359529,16777215,16777215,855309,16777215,16777215,16777215,16777215,16777215,16777215,16777215,16777215,16777215,16777215,16777215,16777215,16777215,16777215,5855577,16777215,16777215,16777215,16777215,6275299,6275299,6275299,6275299,6275299,6275299,6275299,6275299,6275299,6275299,10092543,10092543,16777215,16777215,16777215,16777215,16777215,16777215,16777215,16777215,16777215,16777215,16777215,13158,16777215,0,16777215,16777215,16777215,16777215,16777215,16777215,16777215,16777215,16777215,16777215,16777215,16777215,204,4296113,0,16777215,16777215,16777215,16777215,16777215,16777215,16777215,16777215,16777215,16777215,16777215,16777215,0,16777215,16777215,6740479,16777215,16777215,19816,16777215,16777215,16777215,8092539,6740479,16777215,8421504,16777215,3684410,16777215,16777215,16777215,16777215,801923,16777215,0,0,16777215,16777215,9359529,6740479,6740479,6275299,16777215,16777215,16777215,16777215,16777215,16777215]
[16777215,16777215,16777215,16777215,9359529,9359529,16777215,16777215,801923,16777215,16777215,16777215,16777215,16777215,16777215,16777215,16777215,16777215,16777215,16777215,16777215,16777215,16777215,16777215,16777215,16777215,16777215,16777215,6275299,6275299,6275299,6275299,6275299,6275299,6275299,6275299,6275299,6275299,10092543,10092543,0,16777215,16777215,16777215,16711680,16777215,16777215,16777215,16777215,16777215,16777215,0,16777215,16711680,16777215,16777215,16777215,16777215,16777215,16777215,16777215,16777215,16777215,16777215,16777215,16777215,16777215,4296113,16777215,16777215,16777215,16777215,16777215,16777215,16777215,16777215,16777215,16777215,16777215,16777215,16777215,16777215,15134446,16777215,16777215,16777215,16777215,6275299,16777215,16777215,16777215,6740479,16777215,16777215,0,16777215,16777215,16777215,16777215,16777215,16777215,10086143,16777215,16777215,16777215,16777215,16777215,9359529,16777215,16777215,6275299,16777215,16777215,16777215,16777215,16777215,16777215]
[16777215,16777215,16777215,16777215,9359529,9359529,16777215,16777215,4891128,16777215,16777215,16777215,16777215,16777215,16777215,16777215,16777215,16777215,16777215,16777215,16777215,16777215,16777215,16777215,16777215,16777215,16777215,16777215,6275299,6275299,6275299,6275299,6275299,6275299,6275299,6275299,6275299,6275299,10092543,10092543,16777215,16777215,16777215,16777215,16711680,16777215,16777215,16777215,16777215,16777215,16777215,13158,16777215,16711680,16777215,16777215,16777215,16777215,16777215,16777215,16777215,16777215,16777215,16777215,16777215,16777215,16777215,4296113,16777215,16777215,16777215,16777215,16777215,16777215,16777215,16777215,16777215,16777215,16777215,16777215,16777215,16777215,15134446,16777215,16777215,16777215,16777215,6275299,16777215,16777215,16777215,6740479,16777215,16777215,16777215,16777215,16777215,16777215,16777215,16777215,16777215,10086143,16777215,16777215,16777215,16777215,16777215,9359529,16777215,16777215,6275299,16777215,16777215,16777215,16777215,16777215,16777215]
[16777215,16777215,16777215,16777215,9359529,9359529,16777215,16777215,16777215,16777215,16777215,16777215,16777215,16777215,16777215,16777215,16777215,16777215,16777215,16777215,16777215,16777215,16777215,16777215,16777215,16777215,16777215,16777215,16777215,16777215,16777215,16777215,16777215,16777215,16777215,16777215,16777215,16777215,16777215,16777215,16777215,16777215,16777215,16777215,16711680,16777215,16777215,16777215,16777215,16777215,16777215,16777215,16777215,16711680,16777215,16777215,16777215,16777215,16777215,16777215,16777215,16777215,16777215,16777215,16777215,16777215,16777215,16777215,16777215,16777215,16777215,16777215,16777215,16777215,16777215,16777215,16777215,16777215,16777215,16777215,16777215,16777215,16777215,16777215,16777215,16777215,16777215,16777215,16777215,16777215,16777215,16777215,16777215,16777215,16777215,16777215,16777215,16777215,5855577,16777215,16777215,16777215,16777215,16777215,16777215,16777215,16777215,9359529,16777215,16777215,16777215,16777215,16777215,16777215,16777215,16777215,16777215]
[16777215,16777215,16777215,16777215,9359529,9359529,16777215,16777215,16777215,16777215,16777215,16777215,16777215,16777215,16777215,16777215,16777215,16777215,16777215,16777215,16777215,16777215,16777215,16777215,16777215,16777215,16777215,16777215,16777215,16777215,16777215,16777215,16777215,16777215,16777215,16777215,16777215,16777215,16777215,16777215,16777215,16777215,16777215,16777215,16711680,16777215,16777215,16777215,16777215,16777215,16777215,3368601,16777215,16711680,16777215,16777215,16777215,16777215,16777215,16777215,16777215,16777215,16777215,16777215,16777215,16777215,16777215,16777215,16777215,16777215,16777215,16777215,16777215,16777215,16777215,16777215,16777215,16777215,16777215,16777215,16777215,16777215,16777215,16777215,16777215,16777215,16777215,16777215,16777215,16777215,0,16777215,16777215,16777215,16777215,16777215,16777215,16777215,5287936,16777215,16777215,16777215,16777215,16777215,16777215,16777215,16777215,9359529,16777215,16777215,16777215,16777215,16777215,16777215,3506772,16777215,16777215]
[16777215,16777215,16777215,16777215,9359529,9359529,16777215,16777215,16777215,16777215,16777215,16777215,16777215,16777215,16777215,16777215,0,16777215,16777215,16777215,16777215,30882,16777215,16777215,16777215,11573124,16777215,16777215,16777215,16777215,16777215,16777215,16777215,16777215,16777215,16777215,16777215,16777215,16777215,16777215,0,16777215,16777215,16777215,16711680,16777215,16777215,16777215,16777215,16777215,16777215,3368601,16777215,16711680,16777215,16777215,16777215,16777215,16777215,16777215,16777215,16777215,16777215,16777215,16777215,16777215,16777215,3905232,16777215,16777215,16777215,16777215,255,16777215,16777215,16777215,16777215,16777215,16777215,16777215,16777215,16777215,16777215,16777215,16777215,16777215,7881510,16777215,16777215,16777215,7434613,16777215,16777215,16777215,0,16777215,16777215,16777215,5287936,16777215,16777215,16777215,16777215,16777215,16777215,16777215,16777215,9359529,16777215,16777215,16777215,16777215,16777215,16777215,3506772,16777215,16777215]
[16777215,16777215,16777215,16777215,9359529,9359529,16777215,16777215,16777215,16777215,16777215,16777215,16777215,16777215,16777215,16777215,0,16777215,16777215,16777215,16777215,30882,16777215,16777215,16777215,11573124,0,16777215,16777215,16777215,16777215,16777215,16777215,16777215,16777215,16777215,16777215,16777215,16777215,16777215,0,16777215,16777215,16777215,16711680,16777215,16777215,16777215,16777215,16777215,16777215,13158,16777215,16711680,16777215,16777215,16777215,16777215,16777215,16777215,9634006,16777215,16777215,16777215,16777215,16777215,16777215,3905232,16777215,16777215,16777215,16777215,16777215,16777215,16777215,16777215,16777215,16777215,16777215,16777215,16777215,16777215,16777215,16777215,16777215,16777215,7881510,16777215,16777215,16777215,7434613,16777215,16777215,16777215,0,16777215,16777215,16777215,5287936,16777215,16777215,16777215,16777215,16777215,16777215,16777215,16777215,9359529,3506772,2315831,16777215,16777215,16777215,16777215,3506772,16777215,16777215]
[16777215,16777215,16777215,192,9359529,9359529,16777215,5072516,16777215,16777215,0,16777215,16777215,16777215,16777215,16777215,2460506,801923,0,16777215,16777215,30882,16777215,16777215,0,855309,255,16777215,16777215,16777215,16777215,16777215,16777215,16777215,16777215,16777215,16777215,16777215,16777215,16777215,0,8421504,16777215,16777215,16711680,16777215,16777215,16777215,16777215,16777215,16777215,3368601,5395026,16711680,11389944,16777215,16777215,3243501,16777215,16777215,9634006,16777215,16777215,16777215,0,16777215,16777215,3905232,16777215,16777215,16777215,16777215,16777215,16777215,8696052,16777215,16777215,16777215,16777215,16777215,16777215,16777215,16777215,16777215,6740479,16777215,7881510,16777215,16777215,16777215,0,16777215,6740479,16777215,0,16777215,16777215,5395026,5296274,0,16777215,16777215,0,16777215,16777215,16777215,0,9359529,3506772,3506772,16777215,16777215,0,16777215,3506772,192,16777215]
[1842988,36799,0,0,9359529,9359529,16777215,5263191,16777215,8092539,3243501,8092539,16777215,0,16777215,3684410,3191412,15921906,15921906,65535,0,30882,1137094,5855577,16777215,855309,192,16777215,16777215,16777215,16777215,16777215,16777215,16777215,16777215,16777215,16777215,16777215,16777215,16777215,16777215,0,16777215,16777215,65280,16777215,16777215,16777215,16777215,0,36799,3368601,0,65280,13224393,16777215,16777215,0,3243501,1137094,13408767,5395026,3289655,16777215,11447982,16777215,0,3905232,16777215,15921906,36799,0,16777215,16777215,5855577,16777215,16777215,16777215,16777215,16777215,16777215,16777215,15921906,16777215,6740479,16777215,7881510,16777215,4210752,16777215,7434613,16777215,6740479,192,14277081,2500134,16777215,5395026,5287936,16777215,16777215,16777215,1137094,0,0,3243501,3243501,9359529,2315831,3506772,3506772,192,16777215,36799,0,0,3289655]
[1842988,36799,0,192,5935018,5935018,16777215,5263191,16777215,8092539,0,4210752,16777215,6740479,16777215,3684410,0,15921906,15921906,0,6740479,19816,1137094,5855577,16777215,11573124,192,16777215,16777215,16777215,16777215,16777215,16777215,16777215,16777215,16777215,16777215,16777215,16777215,16777215,14277081,14277081,16777215,42752,16777215,204,16777215,8421504,16777215,801923,36799,16777215,5395026,0,13224393,16777215,801923,3243501,3243501,1137094,16777215,5395026,3289655,3289655,11447982,16777215,0,16777215,11838,15921906,36799,0,16777215,11141282,8696052,16764057,16764057,16764057,16764057,9325614,16777215,11838,16777215,16777215,6740479,16777215,7881510,16777215,4210752,16777215,0,16777215,6740479,192,14277081,2500134,36799,5395026,5287936,16777215,16777215,16777215,1137094,1137094,1137094,3243501,0,5935018,3506772,3506772,3506772,192,16777215,36799,6740479,192,3289655]
[1842988,24704,0,16777215,19816,19816,49407,5263191,16777215,8092539,16777215,4210752,16777215,16777215,1137094,3684410,3191412,15921906,15921906,0,16777215,16777215,6740479,5855577,16777215,855309,10498160,16777215,16777215,16777215,16777215,16777215,16777215,16777215,16777215,16777215,16777215,16777215,16777215,16777215,0,14277081,16777215,5789690,16777215,0,16777215,8421504,16777215,801923,65535,16777215,16777215,0,13224393,16777215,801923,16777215,0,1137094,6684927,0,0,16777215,11447982,16777215,0,16777215,11838,10053375,24704,0,255,5789690,8696052,16764057,16764057,16764057,16764057,9325614,16777215,11838,0,16777215,0,16777215,7881510,16777215,24704,16777215,7434613,16777215,0,0,0,0,36799,5395026,5287936,16777215,16777215,16777215,1137094,1137094,1137094,0,3506772,19816,3506772,3506772,3506772,0,16777215,24704,16777215,3506772,0]
[1842988,36799,0,16777215,13434879,13434879,16777215,5072516,16777215,8092539,16777215,10921638,16777215,0,1137094,3684410,2460506,0,0,3381555,0,16777215,1137094,5855577,16777215,855309,10498160,16777215,16777215,16777215,16777215,16777215,16777215,16777215,16777215,16777215,16777215,16777215,16777215,16777215,0,14277081,16777215,5789690,16777215,204,16777215,855309,16777215,0,36799,13158,16777215,0,13224393,16777215,10086143,16777215,3243501,1137094,6684927,5395026,3289655,16777215,11447982,16777215,0,4296113,11838,15921906,36799,0,16777215,5789690,8696052,13434879,13434879,13434879,0,13434879,0,11838,16777215,16777215,6740479,16777215,16777215,16777215,4210752,16777215,7434613,8092539,6740479,192,0,2500134,36799,5395026,5287936,16777215,16777215,16777215,1137094,1137094,1137094,3243501,16777215,13434879,6740479,6740479,3506772,192,16777215,36799,0,16777215,3289655]
[1842988,36799,11352,16777215,19816,19816,16777215,1709849,801923,8092539,16777215,8092539,666680,16777215,49407,0,0,0,0,15123099,16777215,16777215,1137094,5855577,16777215,11573124,10498160,16777215,6275299,6275299,6275299,6275299,6275299,6275299,6275299,6275299,6275299,6275299,10092543,10092543,14277081,14277081,16777215,5789690,12566463,0,16777215,855309,16777215,16777215,36799,13158,16777215,16777215,13224393,16777215,801923,16777215,3243501,1137094,16777215,5395026,3289655,3289655,11447982,16777215,10921638,4296113,11838,10053375,36799,14412,16777215,5789690,8696052,16764057,16764057,16764057,0,9325614,0,11838,16777215,16777215,13158,16777215,16777215,6275299,4210752,16777215,16777215,8092539,5193523,192,14277081,2500134,0,5395026,5287936,16777215,16777215,10086143,1137094,1137094,1137094,3243501,16777215,19816,5193523,13158,6275299,192,16777215,36799,16777215,16777215,3289655]
[1842988,16777215,11352,16777215,19816,11892015,49407,14083051,1137094,4210752,16777215,4210752,666680,16777215,49407,0,0,0,15921906,16777215,16777215,16777215,6740479,5855577,16764159,11573124,0,16777215,6275299,6275299,6275299,6275299,6275299,6275299,6275299,6275299,6275299,6275299,10092543,10092543,14277081,14277081,5395026,42752,12566463,204,36799,8421504,11352,16777215,16777215,13158,16777215,16777215,13224393,16777215,10086143,16777215,16777215,1137094,16777215,16777215,16777215,16777215,13311,16777215,10921638,4296113,11838,16777215,16777215,14412,16777215,11141282,8696052,16764057,16764057,11854022,16764057,9325614,204,11838,16777215,36799,13158,16777215,16777215,6275299,16777215,16777215,16777215,8092539,5193523,16777215,14277081,16777215,36799,16777215,6740479,13224393,16777215,10086143,255,1137094,1137094,2315831,16777215,11892015,5193523,13158,6275299,3506772,13224393,3506772,16777215,16777215,3506772]
[16777215,16777215,11352,16777215,19816,19816,16777215,14083051,1137094,4210752,16777215,4210752,2199221,16777215,49407,0,10225233,15921906,15921906,16777215,16777215,16777215,6740479,13553360,10086143,10921638,15652797,16777215,6275299,6275299,6275299,6275299,6275299,6275299,6275299,6275299,6275299,6275299,10092543,10092543,14277081,14277081,5395026,42752,12566463,204,36799,15921906,16777215,16777215,16777215,13158,16777215,16777215,13224393,16777215,10086143,16777215,16777215,1137094,16777215,16777215,16777215,16777215,11447982,11352,10921638,4296113,11838,16777215,16777215,14412,16777215,11141282,8696052,16764057,5935018,16764057,16764057,3561320,204,11838,16777215,36799,13158,16777215,16777215,6275299,16777215,16777215,16777215,8092539,5193523,16777215,14277081,16777215,36799,16777215,5296274,13224393,16777215,10086143,65535,1137094,1137094,3506772,16777215,19816,5193523,13158,6275299,3506772,13224393,3506772,16777215,16777215,3506772]
[16777215,16777215,11352,16777215,19816,19816,16777215,5263191,801923,16777215,16777215,16777215,2199221,1137094,49407,0,10225233,15921906,15921906,16777215,16777215,16777215,16777215,5855577,10086143,10921638,10855845,16777215,16728,1281739,16728,15773696,12611584,10498160,10925084,9465920,4525507,1424208,13382400,16764057,12566463,5296274,0,4016795,12566463,204,24704,0,16777215,16777215,16777215,0,16777215,16777215,13224393,16777215,801923,16777215,16777215,1137094,16777215,16777215,16777215,16777215,3770805,16777215,10921638,1589611,11838,16777215,16777215,14412,16777215,977128,3684410,16764057,16764057,16764057,16764057,9325614,204,11838,16777215,24704,13158,16777215,16777215,6275299,16777215,16777215,16777215,8092539,5193523,16777215,12566463,16777215,36799,16777215,5287936,5855577,16777215,10086143,65535,255,255,3506772,16777215,19816,5193523,13158,1424208,3506772,5855577,3506772,1137094,16777215,3506772]
[16777215,16777215,11352,16777215,192,192,16777215,8562637,2500134,16777215,16777215,16777215,2199221,16777215,16777215,0,16777215,801923,0,16777215,16777215,16777215,16777215,13553360,16776960,16777215,15652797,16777215,16728,1281739,16728,15773696,12611584,10498160,10925084,9465920,4525507,1424208,13382400,16764057,0,8421504,5395026,4016795,12566463,6740479,36799,15921906,16777215,16777215,16777215,0,16777215,16777215,16777215,16777215,10086143,16777215,16777215,0,16777215,16777215,16777215,16777215,3770805,16777215,10921638,1589611,11838,16777215,16777215,14412,16777215,977128,3684410,10017782,10017782,10017782,10017782,0,204,11838,15134446,36799,13158,16777215,16777215,1799573,16777215,3610052,16777215,0,5193523,16777215,0,16777215,36799,16777215,5287936,13224393,16777215,1137094,5287936,65535,65535,16777215,16777215,192,5193523,13158,1424208,3506772,13224393,3506772,16777215,16777215,3506772]
[16777215,16777215,11352,16777215,192,192,16777215,5072516,2500134,16777215,16777215,16777215,2199221,16777215,16777215,0,16777215,3243501,3243501,16777215,16777215,16777215,16777215,5855577,0,16777215,0,7998,16728,1281739,16728,15773696,12611584,10498160,10925084,9465920,4525507,1424208,13382400,16764057,8421504,3506772,5395026,16777215,12566463,16777215,36799,0,11352,16777215,16777215,13158,16777215,16777215,16777215,16777215,10086143,16777215,16777215,0,16777215,16777215,16777215,16777215,3175320,11352,10921638,4296113,11838,16777215,16777215,14412,16777215,16777215,3684410,10017782,10017782,10017782,10017782,0,204,11838,15134446,36799,13158,16777215,16777215,1799573,16777215,16777215,16777215,16777215,5193523,16777215,8421504,16777215,36799,16777215,4210752,0,16777215,1137094,5287936,65535,65535,16777215,16777215,192,5193523,13158,1424208,3506772,3506772,16777215,16777215,16777215,16777215]
[16777215,16777215,11352,16777215,9359529,9359529,24704,16777215,2500134,16777215,16777215,16777215,2199221,16777215,16777215,0,16777215,801923,0,16777215,16777215,16777215,16777215,13553360,0,16777215,16777215,16777215,16728,1281739,16728,15773696,12611584,10498160,10925084,9465920,4525507,1424208,13382400,16764057,16777215,11854022,16777215,16777215,12566463,16777215,16777215,16777215,16777215,16777215,16777215,13158,16777215,16777215,16777215,16777215,16777215,16777215,16777215,0,16777215,16777215,16777215,16777215,3770805,16777215,10921638,4296113,0,16777215,16777215,14412,16777215,16777215,16777215,16777215,16777215,16777215,10017782,16777215,16777215,0,15134446,16777215,13158,16777215,16777215,1799573,16777215,3610052,16777215,8092539,5193523,16777215,8421504,16777215,36799,16777215,16777215,0,16777215,1137094,5287936,5287936,5287936,16777215,16777215,9359529,5193523,13158,1424208,16777215,3506772,16777215,16777215,16777215,16777215]
[16777215,16777215,11352,16777215,9359529,9359529,24704,16777215,855309,16777215,16777215,16777215,2199221,14412,16777215,0,16777215,16777215,16777215,16777215,14412,16777215,16777215,5855577,16777215,16777215,16777215,16777215,16728,1281739,16728,15773696,12611584,10498160,10925084,9465920,4525507,1424208,13382400,16764057,8421504,16777215,16777215,16777215,65280,16777215,16777215,16777215,16777215,14412,16777215,0,16777215,65280,16777215,16777215,16777215,16777215,16777215,16777215,16777215,16777215,16777215,16777215,3770805,16777215,16777215,4296113,0,16777215,16777215,14412,16777215,16777215,16777215,16777215,16777215,16777215,10017782,16777215,16777215,0,16777215,16777215,13158,16777215,16777215,19816,16777215,16777215,16777215,8092539,5193523,16777215,8421504,16777215,3684410,16777215,16777215,16777215,16777215,801923,0,5287936,5287936,16777215,16777215,9359529,5193523,13158,1424208,16777215,3506772,16777215,14412,16777215,16777215]
[16777215,16777215,16777215,16777215,9359529,9359529,10086143,16777215,801923,16777215,16777215,16777215,16777215,16777215,16777215,16777215,16777215,16777215,16777215,16777215,16777215,16777215,16777215,5855577,16777215,16777215,16777215,16777215,6275299,6275299,6275299,6275299,6275299,6275299,6275299,6275299,6275299,6275299,10092543,10092543,16777215,16777215,16777215,16777215,16711680,16777215,16777215,16777215,16777215,16777215,16777215,13158,16777215,16711680,16777215,16777215,16777215,16777215,16777215,16777215,16777215,16777215,16777215,16777215,13311,16777215,16777215,4296113,0,16777215,16777215,16777215,16777215,16777215,16777215,16777215,16777215,16777215,10017782,16777215,16777215,0,15134446,16777215,13158,16777215,16777215,6275299,16777215,16777215,16777215,8092539,5193523,16777215,8421504,16777215,3684410,16777215,16777215,16777215,16777215,10086143,16777215,5287936,5287936,16777215,16777215,9359529,5193523,13158,6275299,16777215,16777215,16777215,16777215,16777215,16777215]
[16777215,16777215,16777215,16777215,9359529,9359529,16777215,16777215,4891128,16777215,16777215,16777215,16777215,16777215,16777215,16777215,16777215,16777215,16777215,16777215,16777215,16777215,16777215,16777215,16777215,16777215,16777215,16777215,6275299,6275299,6275299,6275299,6275299,6275299,6275299,6275299,6275299,6275299,10092543,10092543,8421504,16777215,16777215,16777215,16711680,16777215,16777215,16777215,16777215,16777215,16777215,13158,16777215,16711680,16777215,16777215,16777215,16777215,16777215,16777215,16777215,16777215,16777215,16777215,16777215,16777215,16777215,4296113,0,16777215,16777215,16777215,16777215,16777215,16777215,16777215,16777215,16777215,16777215,16777215,16777215,0,15134446,16777215,16777215,16777215,16777215,6275299,16777215,16777215,16777215,6740479,16777215,16777215,8421504,16777215,3684410,16777215,16777215,16777215,16777215,10086143,16777215,0,0,16777215,16777215,9359529,16777215,16777215,6275299,16777215,16777215,16777215,16777215,16777215,16777215]
[16777215,16777215,16777215,16777215,9359529,9359529,16777215,16777215,4891128,16777215,16777215,16777215,16777215,16777215,16777215,16777215,16777215,16777215,16777215,16777215,16777215,16777215,16777215,16777215,16777215,16777215,16777215,16777215,6275299,6275299,6275299,6275299,6275299,6275299,6275299,6275299,6275299,6275299,10092543,10092543,8421504,16777215,16777215,16777215,16711680,16777215,16777215,16777215,16777215,16777215,16777215,0,16777215,16711680,16777215,16777215,16777215,16777215,16777215,16777215,16777215,16777215,16777215,16777215,16777215,16777215,16777215,4296113,16777215,16777215,16777215,16777215,16777215,16777215,16777215,16777215,16777215,16777215,16777215,16777215,16777215,16777215,16777215,16777215,16777215,16777215,16777215,6275299,16777215,16777215,16777215,6740479,16777215,16777215,8421504,16777215,3684410,16777215,16777215,16777215,16777215,10086143,16777215,16777215,16777215,16777215,16777215,9359529,16777215,16777215,6275299,16777215,16777215,16777215,16777215,16777215,16777215]
[16777215,16777215,16777215,16777215,9359529,9359529,16777215,16777215,16777215,16777215,16777215,16777215,16777215,16777215,16777215,16777215,16777215,16777215,16777215,16777215,16777215,16777215,16777215,16777215,16777215,16777215,16777215,16777215,16777215,16777215,16777215,16777215,16777215,16777215,16777215,16777215,16777215,16777215,16777215,16777215,16777215,16777215,16777215,16777215,16711680,16777215,16777215,16777215,16777215,16777215,16777215,16777215,16777215,16711680,16777215,16777215,16777215,16777215,16777215,16777215,16777215,16777215,16777215,16777215,16777215,16777215,16777215,16777215,16777215,16777215,16777215,16777215,11184814,16777215,16777215,16777215,16777215,16777215,16777215,16777215,16777215,16777215,16777215,16777215,16777215,16777215,11184814,16777215,16777215,16777215,16777215,16777215,16777215,16777215,16777215,16777215,16777215,16777215,4210752,16777215,16777215,16777215,16777215,16777215,16777215,16777215,16777215,9359529,16777215,16777215,16777215,16777215,16777215,16777215,3506772,16777215,16777215]
[16777215,16777215,16777215,16777215,9359529,9359529,16777215,16777215,16777215,16777215,16777215,16777215,16777215,16777215,16777215,16777215,16777215,16777215,16777215,16777215,16777215,30882,16777215,16777215,16777215,16777215,16777215,16777215,16777215,16777215,16777215,16777215,16777215,16777215,16777215,16777215,16777215,16777215,16777215,16777215,16777215,16777215,16777215,16777215,16711680,16777215,16777215,16777215,16777215,16777215,16777215,16777215,16777215,16711680,16777215,16777215,16777215,16777215,16777215,16777215,16777215,16777215,16777215,16777215,16777215,16777215,16777215,16777215,16777215,16777215,16777215,16777215,11184814,16777215,16777215,16777215,16777215,16777215,16777215,16777215,16777215,16777215,16777215,16777215,16777215,16777215,11184814,16777215,16777215,16777215,16777215,16777215,16777215,16777215,16777215,16777215,16777215,16777215,5287936,16777215,16777215,16777215,16777215,16777215,16777215,16777215,16777215,9359529,16777215,16777215,16777215,16777215,16777215,16777215,3506772,16777215,16777215]
[16777215,16777215,16777215,16777215,9359529,9359529,16777215,16777215,16777215,16777215,16777215,16777215,16777215,16777215,16777215,16777215,0,16777215,16777215,16777215,16777215,30882,16777215,16777215,16777215,11573124,16777215,16777215,16777215,16777215,16777215,16777215,16777215,16777215,16777215,16777215,16777215,16777215,16777215,16777215,16777215,16777215,16777215,16777215,16711680,16777215,16777215,16777215,16777215,16777215,16777215,16777215,16777215,16711680,11389944,16777215,16777215,16777215,16777215,16777215,16777215,16777215,16777215,16777215,16777215,16777215,16777215,16777215,16777215,16777215,16777215,16777215,255,16777215,16777215,16777215,16777215,16777215,16777215,16777215,16777215,16777215,16777215,16777215,6740479,16777215,7881510,16777215,16777215,16777215,7434613,16777215,6740479,16777215,16777215,16777215,16777215,16777215,5296274,16777215,16777215,16777215,16777215,16777215,16777215,16777215,16777215,9359529,6740479,6740479,16777215,16777215,16777215,16777215,3506772,16777215,16777215]
[16777215,16777215,16777215,192,9359529,9359529,16777215,16777215,16777215,16777215,0,16777215,16777215,16777215,16777215,16777215,0,16777215,16777215,16777215,16777215,0,16777215,16777215,0,11573124,0,16777215,16777215,16777215,16777215,16777215,16777215,16777215,16777215,16777215,16777215,16777215,16777215,16777215,16777215,16777215,16777215,16777215,16711884,16777215,16777215,16777215,16777215,16777215,16777215,13158,5395026,65535,11389944,6966,16777215,3243501,16777215,16777215,16777215,16777215,16777215,16777215,0,16777215,16777215,16777215,16777215,16777215,16777215,16777215,255,16777215,16777215,16777215,16777215,16777215,16777215,16777215,16777215,16777215,16777215,16777215,6740479,1137094,7881510,16777215,16777215,16777215,7434613,8092539,6740479,16777215,16777215,16777215,16777215,16777215,5296274,0,855309,16777215,0,16777215,16777215,16777215,0,9359529,3506772,3506772,16777215,16777215,0,16777215,3506772,192,16777215]
[16777215,16777215,16777215,192,5935018,5935018,16777215,1709849,16777215,16777215,0,16777215,16777215,16777215,16777215,16777215,0,15921906,15921906,16777215,16777215,30882,16777215,16777215,16777215,11573124,192,16777215,16777215,16777215,16777215,16777215,16777215,16777215,16777215,16777215,16777215,16777215,16777215,16777215,0,8421504,16777215,16777215,16711884,16777215,16777215,16777215,16777215,16777215,16777215,3368601,5395026,65535,11389944,16777215,16777215,3243501,16777215,1137094,9634006,16777215,16777215,16777215,11447982,16777215,16777215,3905232,16777215,16777215,16777215,16777215,255,16777215,8696052,16769217,16769217,16769217,16769217,16769217,16777215,16777215,15921906,16777215,6740479,7434613,7881510,16777215,16777215,16777215,7434613,8092539,6740479,16777215,0,16777215,16777215,16777215,5287936,13224393,7434613,16777215,0,16777215,16777215,16777215,0,5935018,3506772,3506772,3506772,16777215,13224393,16777215,3506772,192,16777215]
[1842988,16777215,0,192,5935018,5935018,16777215,5263191,16777215,0,0,4210752,16777215,0,16777215,3684410,5296274,15921906,15921906,16777215,0,30882,16777215,5855577,16777215,855309,192,16777215,16777215,16777215,16777215,16777215,16777215,16777215,16777215,16777215,16777215,16777215,16777215,16777215,16777215,0,16777215,42752,16711884,16777215,16777215,0,16777215,0,16777215,3368601,5395026,65535,13224393,16777215,10086143,3243501,16777215,1137094,9634006,16777215,16777215,16777215,13311,16777215,0,3905232,11838,16777215,16777215,0,255,11141282,8696052,16764057,16764057,16764057,16764057,16764057,16777215,11838,16777215,16777215,6740479,1137094,7881510,16777215,16777215,16777215,7434613,8092539,6740479,16777215,14277081,16777215,16777215,5395026,5287936,16777215,855309,16777215,1137094,0,0,16777215,0,5935018,3506772,3506772,3506772,16777215,16777215,16777215,0,192,16777215]
[1842988,36799,0,192,19816,19816,49407,5263191,16777215,0,0,4210752,16777215,6740479,16777215,3684410,0,15921906,15921906,5296274,6740479,30882,6740479,5855577,0,11573124,10498160,16777215,16777215,16777215,16777215,16777215,16777215,16777215,16777215,16777215,16777215,16777215,16777215,16777215,14277081,14277081,16777215,42752,16711884,204,16777215,8421504,16777215,801923,36799,16777215,5395026,65535,13224393,16777215,801923,3243501,3243501,1137094,13408767,5395026,3289655,3289655,11447982,16777215,0,16777215,11838,15921906,36799,0,255,11141282,8696052,16764057,16764057,16764057,16764057,16764057,16777215,11838,16777215,16777215,6740479,16777215,7881510,16777215,4210752,16777215,0,8092539,6740479,36799,14277081,36799,36799,5395026,5287936,0,16777215,16777215,1137094,1137094,1137094,3243501,0,19816,3506772,3506772,3506772,36799,0,36799,6740479,192,3289655]
[1842988,36799,0,0,19816,19816,49407,5263191,16777215,0,3243501,4210752,16777215,16777215,49407,3684410,5296274,0,0,5287936,16777215,19816,6740479,5855577,16777215,855309,10498160,16777215,16777215,16777215,16777215,16777215,16777215,16777215,16777215,16777215,16777215,16777215,16777215,16777215,0,14277081,16777215,5789690,16777215,204,16777215,855309,16777215,16777215,36799,3368601,0,0,9851952,16777215,10086143,0,36799,1137094,13408767,5395026,3289655,3289655,11447982,16777215,0,0,11838,15921906,36799,0,255,5789690,5855577,16764057,16764057,16764057,16764057,16764057,0,11838,16777215,16777215,3368601,16777215,7881510,16777215,4210752,16777215,0,8092539,7434613,36799,0,36799,36799,5395026,5287936,16777215,16777215,16777215,1137094,0,0,36799,3506772,19816,7434613,3368601,3506772,36799,16777215,36799,16777215,3506772,3289655]
[1842988,36799,0,16777215,0,0,49407,1709849,16777215,8092539,16777215,8092539,666680,0,49407,3684410,0,12874308,255,3381555,0,19816,1137094,5855577,16777215,11573124,0,16777215,16777215,16777215,16777215,16777215,16777215,16777215,16777215,16777215,16777215,16777215,16777215,16777215,0,14277081,0,656128,16777215,204,24704,8421504,16777215,0,36799,3368601,16777215,0,13224393,16777215,801923,16777215,36799,0,13408767,5395026,3289655,16777215,11447982,16777215,0,0,11838,15921906,36799,0,16777215,656128,8696052,0,0,0,0,0,0,11838,16777215,24704,13158,16777215,16777215,16777215,4210752,16777215,7434613,8092539,5193523,36799,0,36799,36799,5395026,5287936,16777215,16777215,16777215,1137094,1137094,1137094,36799,3506772,0,5193523,13158,3506772,36799,16777215,36799,0,3506772,3289655]
[1842988,36799,11352,16777215,19816,11892015,49407,14083051,801923,8092539,16777215,8092539,666680,16777215,49407,0,0,16777215,16777215,0,16777215,16777215,1137094,5855577,16777215,11573124,0,16777215,6275299,6275299,6275299,6275299,6275299,6275299,6275299,6275299,6275299,6275299,10092543,10092543,14277081,14277081,0,5789690,12566463,204,24704,0,16777215,16777215,36799,3368601,16777215,16777215,13224393,16777215,801923,16777215,36799,16777215,13408767,5395026,3289655,3289655,13311,16777215,10921638,0,11838,15921906,36799,14412,16777215,5789690,8696052,16764057,16764057,11854022,16764057,16764057,204,11838,16777215,24704,13158,16777215,16777215,6275299,4210752,16777215,0,8092539,5193523,36799,14277081,36799,36799,5395026,5287936,16777215,16777215,10086143,1137094,1137094,1137094,36799,16777215,11892015,5193523,13158,6275299,36799,16777215,36799,16777215,16777215,3289655]
[1842988,24704,0,16777215,19816,19816,49407,14083051,1137094,8092539,16777215,4210752,666680,16777215,1137094,255,0,15921906,15921906,0,16777215,16777215,6740479,13553360,16777215,11573124,15652797,16777215,6275299,6275299,6275299,6275299,6275299,6275299,6275299,6275299,6275299,6275299,10092543,10092543,14277081,14277081,5395026,42752,5855577,204,36799,15921906,11352,16777215,65535,13158,16777215,0,9851952,16777215,10086143,16777215,0,1137094,6684927,0,0,3289655,11447982,0,0,4296113,11838,10053375,24704,0,16777215,11141282,8696052,16764057,5935018,16764057,16764057,3561320,204,11838,16777215,36799,13158,16777215,16777215,6275299,14277081,16777215,16777215,8092539,5193523,0,14277081,12611584,36799,0,6740479,16777215,16777215,10086143,255,1137094,1137094,3506772,16777215,19816,5193523,13158,6275299,0,16777215,24704,16777215,16777215,0]
[1842988,24704,0,16777215,19816,19816,49407,14083051,4891128,4210752,16777215,4210752,2199221,0,1137094,255,10225233,15921906,15921906,0,0,16777215,6740479,13553360,16764159,10921638,10855845,16777215,6275299,6275299,6275299,6275299,6275299,6275299,6275299,6275299,6275299,6275299,10092543,10092543,14277081,14277081,5395026,42752,12566463,204,36799,15921906,11352,12874308,65535,13158,16777215,16777215,13224393,16777215,801923,16777215,0,1137094,6684927,0,0,16777215,3770805,0,10921638,4296113,11838,10053375,24704,0,16777215,11141282,8696052,16764057,16764057,16764057,16764057,16764057,204,11838,16777215,36799,16777215,16777215,16777215,6275299,14277081,16777215,16777215,8092539,16777215,0,14277081,12611584,36799,0,6740479,13224393,16777215,10086143,255,1137094,1137094,3506772,16777215,19816,16777215,16777215,6275299,0,13224393,24704,0,16777215,0]
[16777215,16777215,11352,16777215,19816,19816,16777215,1709849,2500134,16777215,16777215,4210752,0,16777215,1137094,0,10225233,15921906,15921906,16777215,16777215,16777215,6740479,13553360,16776960,10921638,15652797,10929378,16728,1281739,16728,15773696,12611584,10498160,10925084,9465920,4525507,1424208,13382400,16764057,12566463,12566463,5395026,42752,12566463,204,36799,15921906,16777215,16777215,16777215,13158,16777215,16777215,13224393,16777215,801923,16777215,16777215,1137094,16777215,16777215,16777215,16777215,3770805,0,10921638,4296113,11838,16777215,16777215,14412,16777215,11141282,8696052,16764057,16764057,16764057,16764057,16764057,0,11838,16777215,36799,16777215,16777215,16777215,1799573,16777215,16777215,16777215,8092539,16777215,16777215,12566463,16777215,36799,16777215,5287936,13224393,16777215,1137094,65535,255,255,3506772,16777215,19816,16777215,16777215,1424208,3506772,13224393,3506772,16777215,16777215,3506772]
[16777215,16777215,11352,16777215,192,192,16777215,5263191,2500134,16777215,16777215,16777215,2199221,16777215,1137094,0,10225233,3243501,3243501,16777215,16777215,16777215,16777215,13553360,16776960,10921638,0,7998,16728,1281739,16728,15773696,12611584,10498160,10925084,9465920,4525507,1424208,13382400,16764057,12566463,3506772,5395026,4016795,12566463,6740479,36799,0,11352,16777215,16777215,0,16777215,16777215,16777215,16777215,10086143,16777215,16777215,0,16777215,16777215,16777215,16777215,3175320,11352,10921638,4296113,11838,16777215,16777215,14412,16777215,977128,3684410,16764057,16764057,16764057,16764057,0,0,11838,16777215,36799,13158,16777215,16777215,1799573,16777215,3610052,16777215,8092539,5193523,16777215,12566463,16777215,36799,16777215,5287936,5855577,16777215,1137094,65535,255,255,16777215,16777215,192,5193523,13158,1424208,3506772,5855577,3506772,16777215,16777215,3506772]
[16777215,16777215,0,16777215,192,192,16777215,8562637,2500134,16777215,16777215,16777215,2199221,0,16777215,255,16777215,801923,0,16777215,0,16777215,16777215,13553360,16776960,16777215,16777215,7998,16728,1281739,16728,15773696,12611584,10498160,10925084,9465920,4525507,1424208,13382400,16764057,0,3506772,16777215,4016795,5855577,6740479,16777215,16777215,11352,12874308,16777215,13158,16777215,0,16777215,16777215,10086143,16777215,16777215,0,16777215,16777215,16777215,16777215,3770805,11352,0,4296113,11838,16777215,16777215,0,16777215,977128,3684410,10017782,10017782,10017782,5935018,0,204,11838,15134446,16777215,13158,16777215,16777215,1799573,16777215,0,16777215,8092539,5193523,16777215,0,16777215,36799,16777215,4210752,13224393,16777215,1137094,5287936,65535,65535,16777215,16777215,192,5193523,13158,1424208,2315831,13224393,16777215,0,16777215,3506772]
[16777215,16777215,0,16777215,9359529,9359529,16777215,5072516,2500134,16777215,16777215,16777215,0,16777215,16777215,255,16777215,801923,0,16777215,16777215,16777215,16777215,13553360,0,16777215,16777215,10929378,16728,1281739,16728,15773696,12611584,10498160,10925084,9465920,4525507,1424208,13382400,16764057,8421504,8421504,16777215,16777215,12566463,16777215,16777215,16777215,16777215,16777215,16777215,13158,16777215,16777215,16777215,16777215,16777215,16777215,16777215,0,16777215,16777215,16777215,16777215,3175320,16777215,10921638,4296113,11838,16777215,16777215,0,16777215,16777215,3684410,16777215,16777215,16777215,5935018,16777215,204,11838,16777215,16777215,13158,16777215,16777215,1799573,16777215,3610052,16777215,8092539,5193523,16777215,8421504,16777215,36799,16777215,4210752,0,16777215,1137094,5287936,65535,65535,16777215,16777215,9359529,5193523,13158,1424208,16777215,3506772,16777215,16777215,16777215,16777215]
[16777215,16777215,11352,16777215,9359529,9359529,24704,16777215,2500134,16777215,16777215,16777215,2199221,14412,16777215,0,16777215,801923,0,16777215,14412,16777215,16777215,13553360,0,16777215,16777215,16777215,16728,1281739,16728,15773696,12611584,10498160,10925084,9465920,4525507,1424208,13382400,16764057,8421504,16777215,16777215,16777215,16711884,16777215,16777215,16777215,16777215,14412,16777215,0,16777215,65535,16777215,16777215,16777215,16777215,16777215,0,16777215,16777215,16777215,16777215,3770805,16777215,16777215,4296113,11838,16777215,16777215,14412,16777215,16777215,16777215,16777215,16777215,16777215,5935018,16777215,16777215,11838,15134446,16777215,16777215,16777215,16777215,1799573,16777215,16777215,16777215,8092539,16777215,16777215,8421504,16777215,3684410,16777215,16777215,0,16777215,1137094,5287936,5287936,5287936,16777215,16777215,9359529,16777215,16777215,1424208,16777215,3506772,16777215,14412,16777215,16777215]
[16777215,16777215,16777215,16777215,9359529,9359529,24704,16777215,801923,16777215,16777215,16777215,16777215,16777215,16777215,16777215,16777215,801923,0,16777215,16777215,16777215,16777215,5855577,0,16777215,16777215,16777215,6275299,6275299,6275299,6275299,6275299,6275299,6275299,6275299,6275299,6275299,10092543,10092543,16777215,16777215,16777215,16777215,16711884,16777215,16777215,16777215,16777215,16777215,16777215,13158,16777215,65535,16777215,16777215,16777215,16777215,16777215,0,16777215,16777215,16777215,16777215,3770805,16777215,16777215,4296113,0,16777215,16777215,16777215,16777215,16777215,16777215,16777215,16777215,16777215,5935018,16777215,16777215,0,15134446,16777215,16777215,16777215,16777215,6275299,16777215,16777215,16777215,8092539,16777215,16777215,8421504,16777215,3684410,16777215,16777215,0,16777215,10086143,0,5287936,5287936,16777215,16777215,9359529,16777215,16777215,6275299,16777215,3506772,16777215,16777215,16777215,16777215]
[16777215,16777215,16777215,16777215,9359529,9359529,10086143,16777215,4891128,16777215,16777215,16777215,16777215,16777215,16777215,16777215,16777215,16777215,16777215,16777215,16777215,16777215,16777215,16777215,16777215,16777215,16777215,16777215,6275299,6275299,6275299,6275299,6275299,6275299,6275299,6275299,6275299,6275299,10092543,10092543,16777215,16777215,16777215,16777215,16711680,16777215,16777215,16777215,16777215,16777215,16777215,13158,16777215,16711680,16777215,16777215,16777215,16777215,16777215,16777215,16777215,16777215,16777215,16777215,16777215,16777215,16777215,4296113,0,16777215,16777215,16777215,16777215,16777215,16777215,16777215,16777215,16777215,5935018,16777215,16777215,0,16777215,16777215,16777215,16777215,16777215,6275299,16777215,16777215,16777215,6740479,16777215,16777215,8421504,16777215,3684410,16777215,16777215,16777215,16777215,10086143,16777215,5287936,5287936,16777215,16777215,9359529,16777215,16777215,6275299,16777215,16777215,16777215,16777215,16777215,16777215]
[16777215,16777215,16777215,16777215,9359529,9359529,16777215,16777215,16777215,16777215,16777215,16777215,16777215,16777215,16777215,16777215,16777215,16777215,16777215,16777215,16777215,16777215,16777215,16777215,16777215,16777215,16777215,16777215,16777215,16777215,16777215,16777215,16777215,16777215,16777215,16777215,16777215,16777215,16777215,16777215,8421504,16777215,16777215,16777215,16711680,16777215,16777215,16777215,16777215,16777215,16777215,0,16777215,16711680,16777215,16777215,16777215,16777215,16777215,16777215,16777215,16777215,16777215,16777215,16777215,16777215,16777215,4296113,0,16777215,16777215,16777215,16777215,16777215,16777215,16777215,16777215,16777215,16777215,16777215,16777215,0,16777215,16777215,16777215,16777215,16777215,16777215,16777215,16777215,16777215,6740479,16777215,16777215,8421504,16777215,3684410,16777215,16777215,16777215,16777215,16777215,16777215,0,0,16777215,16777215,9359529,16777215,16777215,16777215,16777215,16777215,16777215,16777215,16777215,16777215]
[16777215,16777215,16777215,16777215,9359529,9359529,16777215,16777215,16777215,16777215,16777215,16777215,16777215,16777215,16777215,16777215,16777215,16777215,16777215,16777215,16777215,30882,16777215,16777215,16777215,16777215,16777215,16777215,16777215,16777215,16777215,16777215,16777215,16777215,16777215,16777215,16777215,16777215,16777215,16777215,16777215,16777215,16777215,16777215,16711680,16777215,16777215,16777215,16777215,16777215,16777215,16777215,16777215,16711680,11389944,16777215,16777215,16777215,16777215,16777215,16777215,16777215,16777215,16777215,16777215,16777215,16777215,16777215,16777215,16777215,16777215,16777215,16777215,16777215,16777215,16777215,16777215,16777215,16777215,16777215,16777215,16777215,16777215,16777215,6740479,16777215,16777215,16777215,16777215,16777215,16777215,16777215,6740479,16777215,16777215,16777215,16777215,16777215,4210752,16777215,16777215,16777215,16777215,16777215,16777215,16777215,16777215,9359529,6740479,6740479,16777215,16777215,16777215,16777215,3506772,16777215,16777215]
[16777215,16777215,16777215,192,9359529,9359529,16777215,16777215,16777215,16777215,0,16777215,16777215,16777215,16777215,16777215,16777215,16777215,16777215,16777215,16777215,30882,16777215,16777215,0,16777215,16777215,16777215,16777215,16777215,16777215,16777215,16777215,16777215,16777215,16777215,16777215,16777215,16777215,16777215,16777215,16777215,16777215,16777215,16711680,16777215,16777215,16777215,16777215,16777215,16777215,16777215,5395026,16711680,11389944,16777215,16777215,3243501,16777215,16777215,16777215,16777215,16777215,16777215,16777215,16777215,16777215,16777215,16777215,16777215,16777215,16777215,801923,16777215,16777215,16777215,16777215,16777215,16777215,16777215,16777215,16777215,16777215,16777215,6740479,16777215,801923,16777215,16777215,16777215,16777215,16777215,6740479,16777215,16777215,16777215,16777215,16777215,4210752,0,16777215,16777215,16777215,16777215,16777215,16777215,0,9359529,6740479,6740479,16777215,16777215,0,16777215,3506772,192,16777215]
[16777215,16777215,16777215,192,5935018,5935018,16777215,16777215,16777215,16777215,0,16777215,16777215,16777215,16777215,16777215,0,15921906,15921906,16777215,16777215,30882,16777215,16777215,0,11573124,16777215,16777215,16777215,16777215,16777215,16777215,16777215,16777215,16777215,16777215,16777215,16777215,16777215,16777215,16777215,16777215,16777215,16777215,16711680,16777215,16777215,16777215,16777215,16777215,16777215,16777215,5395026,16711680,11389944,13294830,16777215,3243501,16777215,1137094,16777215,16777215,16777215,16777215,0,16777215,16777215,16777215,16777215,16777215,16777215,16777215,801923,16777215,8696052,16769217,16777215,16769217,16769217,16777215,16777215,16777215,16777215,16777215,6740479,1137094,801923,16777215,16777215,16777215,7434613,0,6740479,16777215,16777215,16777215,16777215,16777215,4210752,0,855309,16777215,16777215,16777215,16777215,16777215,0,5935018,3506772,3506772,16777215,16777215,0,16777215,3506772,192,16777215]
[16777215,16777215,16777215,0,5935018,5935018,16777215,1709849,16777215,16777215,3243501,16777215,16777215,16777215,16777215,16777215,0,3243501,3243501,16777215,16777215,30882,16777215,16777215,16777215,11573124,0,16777215,16777215,16777215,16777215,16777215,16777215,16777215,16777215,16777215,16777215,16777215,16777215,16777215,0,16777215,16777215,16777215,16711884,16777215,16777215,16777215,16777215,16777215,16777215,16777215,0,65535,11389944,6966,16777215,12874308,16777215,1137094,16777215,16777215,16777215,16777215,11447982,16777215,16777215,16777215,16777215,16777215,16777215,16777215,0,16777215,8696052,16769217,5935018,16769217,16769217,3561320,16777215,16777215,16777215,16777215,6740479,1137094,0,16777215,16777215,16777215,4210752,0,6740479,16777215,0,16777215,16777215,16777215,4210752,13224393,855309,16777215,0,16777215,16777215,16777215,3243501,5935018,2315831,3506772,16777215,16777215,13224393,16777215,3506772,0,16777215]
[3293276,16777215,0,192,5935018,5935018,49407,1709849,16777215,8092539,0,16777215,16777215,0,16777215,3684410,0,15921906,15921906,16777215,0,30882,16777215,5855577,16777215,11573124,10498160,16777215,16777215,16777215,16777215,16777215,16777215,16777215,16777215,16777215,16777215,16777215,16777215,16777215,16777215,0,16777215,42752,16737996,204,16777215,8421504,16777215,801923,16777215,16777215,5395026,584700,11389944,6966,16777215,3243501,16777215,1137094,9634006,16777215,3289655,16777215,11447982,16777215,0,16777215,11838,16777215,16777215,0,255,11141282,8696052,16764057,16764057,16764057,16764057,15454147,16777215,11838,15921906,16777215,6740479,1137094,7881510,16777215,16777215,16777215,4210752,8092539,6740479,16777215,14277081,16777215,36799,16777215,16777215,16777215,855309,16777215,8696052,0,0,16777215,0,5935018,3506772,2315831,3506772,16777215,16777215,16777215,0,192,3289655]
[3688550,36799,0,192,19816,19816,49407,5263191,16777215,8092539,0,8092539,16777215,6740479,16777215,3684410,0,15921906,15921906,65535,6740479,30882,1137094,5855577,16777215,11573124,10498160,16777215,16777215,16777215,16777215,16777215,16777215,16777215,16777215,16777215,16777215,16777215,16777215,16777215,14277081,14277081,16777215,42752,16737996,204,16777215,0,16777215,801923,36799,3368601,5395026,584700,13224393,16777215,10086143,3243501,36799,1137094,13408767,5395026,3289655,16777215,11447982,16777215,0,16777215,11838,15921906,36799,0,255,11141282,8696052,16764057,16764057,16764057,16764057,15454147,0,11838,16777215,16777215,6740479,1137094,7881510,16777215,4210752,16777215,4210752,8092539,6740479,36799,14277081,36799,36799,5395026,16777215,16777215,855309,16777215,8696052,8696052,8696052,36799,0,19816,3506772,3506772,3506772,36799,16777215,36799,6740479,192,3289655]
[3688550,36799,0,192,19816,19816,49407,5263191,16777215,0,0,4210752,16777215,1137094,16777215,3684410,0,15921906,15921906,5296274,6740479,30882,6740479,5855577,0,11573124,10498160,16777215,16777215,16777215,16777215,16777215,16777215,16777215,16777215,16777215,16777215,16777215,16777215,16777215,14277081,14277081,16777215,42752,16711884,26367,16777215,8421504,16777215,801923,36799,16777215,5395026,65535,13224393,16777215,801923,3243501,36799,1137094,13408767,5395026,3289655,3289655,13311,16777215,0,16777215,11838,15921906,36799,0,255,11141282,8696052,16764057,16764057,16764057,16764057,15454147,0,11838,16777215,16777215,3368601,5855577,7881510,16777215,4210752,16777215,0,8092539,7434613,36799,14277081,2500134,36799,5395026,5287936,0,5855577,16777215,1137094,1137094,1137094,36799,0,19816,3506772,3506772,3506772,36799,0,36799,1137094,192,3289655]
[2634568,0,0,0,19816,19816,3243501,5263191,16777215,8092539,3243501,14395790,666680,16777215,49407,3684410,0,15921906,15921906,0,16777215,30882,0,5855577,0,11573124,0,16777215,16777215,16777215,16777215,16777215,16777215,16777215,16777215,16777215,16777215,16777215,16777215,16777215,14277081,11573124,0,5789690,16777215,26367,24704,8421504,16777215,16777215,0,13158,0,0,13224393,16777215,801923,3243501,6968388,1137094,0,0,0,3289655,11447982,16777215,0,4296113,11838,0,0,0,255,5789690,8696052,16764057,16764057,16764057,16764057,15454147,0,11838,16777215,24704,3368601,5855577,7881510,16777215,8421504,16777215,0,8092539,7434613,0,14277081,0,36799,0,5287936,0,5855577,16777215,1137094,1137094,1137094,6968388,3243501,19816,7434613,3368601,3506772,0,0,0,16777215,0,0]
[3688550,36799,0,0,19816,11892015,49407,1709849,1137094,8092539,3243501,8092539,666680,0,49407,3684410,0,15921906,15921906,3381555,0,19816,1137094,5855577,16777215,11573124,15652797,16777215,6275299,6275299,6275299,6275299,6275299,6275299,6275299,6275299,6275299,6275299,10092543,10092543,14277081,11573124,0,5789690,16777215,204,24704,0,16777215,0,36799,0,0,0,13224393,16777215,2500134,3243501,36799,1137094,13408767,5395026,3289655,0,13311,16777215,0,4296113,11838,15921906,36799,0,1137094,5789690,8696052,16764057,16764057,11854022,16764057,15454147,204,11838,16777215,24704,13158,16777215,0,6275299,4210752,16777215,0,8092539,5193523,36799,14277081,36799,36799,5395026,5287936,16777215,16777215,10086143,1137094,1137094,1137094,36799,3506772,11892015,5193523,13158,6275299,36799,16777215,36799,0,3506772,3289655]
[1842988,36799,11352,0,19816,19816,49407,1709849,801923,8092539,3243501,8092539,666680,16777215,49407,0,0,15921906,15921906,15123099,16777215,19816,1137094,13553360,16777215,11573124,15652797,16777215,6275299,6275299,6275299,6275299,6275299,6275299,6275299,6275299,6275299,6275299,10092543,10092543,14277081,14277081,5395026,5789690,12566463,204,36799,15921906,16777215,16777215,36799,13158,0,16777215,13224393,16777215,801923,3243501,36799,1137094,13408767,5395026,3289655,3289655,11447982,0,10921638,4296113,11838,15921906,36799,14412,16777215,5789690,8696052,16764057,5935018,16764057,16764057,3561320,204,11838,16777215,36799,13158,16777215,16777215,6275299,4210752,16777215,0,8092539,5193523,36799,14277081,36799,36799,5395026,5287936,16777215,16777215,10086143,1137094,1137094,1137094,36799,3506772,19816,5193523,13158,6275299,36799,16777215,36799,16777215,3506772,3289655]
[1842988,36799,0,16777215,19816,19816,49407,14083051,1137094,8092539,16777215,8092539,666680,16777215,49407,255,10225233,15921906,15921906,11892015,16777215,16777215,1137094,13553360,16777215,10921638,15652797,10929378,6275299,6275299,6275299,6275299,6275299,6275299,6275299,6275299,6275299,6275299,10092543,10092543,14277081,14277081,5395026,42752,12566463,204,36799,15921906,11352,16777215,36799,3368601,16777215,16777215,13224393,16777215,2500134,16777215,36799,1137094,13408767,5395026,3289655,3289655,11447982,0,10921638,0,11838,15921906,36799,0,16777215,11141282,8696052,16764057,16764057,16764057,16764057,15454147,204,11838,16777215,36799,13158,16777215,16777215,6275299,4210752,16777215,7434613,8092539,5193523,36799,14277081,36799,36799,5395026,5287936,16777215,16777215,10086143,0,1137094,1137094,3506772,16777215,19816,5193523,13158,6275299,36799,16777215,36799,16777215,16777215,3289655]
[1842988,24704,0,16777215,19816,19816,49407,14083051,2500134,4210752,16777215,4210752,2199221,0,1137094,255,10225233,15921906,15921906,0,0,16777215,6740479,0,16777215,10921638,15652797,10929378,16728,1281739,16728,15773696,12611584,10498160,10925084,9465920,4525507,1424208,13382400,16764057,14277081,14277081,5395026,42752,12566463,204,36799,15921906,11352,12874308,65535,13158,16777215,16777215,13224393,16777215,801923,16777215,0,1137094,6684927,0,0,16777215,3770805,0,10921638,4296113,11838,10053375,24704,0,16777215,11141282,8696052,16764057,16764057,16764057,16764057,15454147,204,11838,16777215,36799,16777215,16777215,16777215,1799573,14277081,16777215,7434613,8092539,16777215,0,14277081,12611584,36799,0,6740479,16777215,16777215,1137094,255,1137094,1137094,2315831,16777215,19816,16777215,16777215,1424208,0,16777215,24704,0,16777215,0]
[1842988,24704,11352,16777215,19816,19816,16777215,1709849,2315831,4210752,16777215,4210752,2199221,16777215,1137094,0,10225233,3243501,3243501,0,16777215,16777215,6740479,0,16764159,10921638,0,10929378,0,0,0,0,0,0,0,0,0,0,0,0,12566463,12566463,0,42752,12566463,204,0,0,0,16777215,65535,13158,16777215,16777215,13224393,16777215,801923,16777215,0,0,6684927,0,0,16777215,3175320,0,10921638,4296113,11838,10053375,24704,14412,16777215,11141282,8696052,16764057,16764057,16764057,16764057,15454147,0,11838,16777215,0,0,16777215,16777215,0,14277081,0,4210752,8092539,0,0,12566463,12611584,36799,0,6740479,13224393,16777215,6567712,255,0,0,3506772,16777215,19816,0,0,0,0,13224393,3506772,16777215,16777215,0]
[1842988,16777215,11352,16777215,192,192,16777215,14083051,2500134,4210752,16777215,4210752,2199221,16777215,1137094,0,10225233,801923,0,16777215,16777215,16777215,6740479,13553360,16776960,10921638,16777215,13158,0,0,0,0,0,0,0,0,0,0,0,0,12566463,3506772,5395026,42752,12566463,6740479,36799,15921906,11352,16777215,16777215,0,16777215,16777215,16777215,16777215,10086143,16777215,16777215,0,16777215,16777215,16777215,16777215,3770805,11352,10921638,4296113,11838,16777215,16777215,14412,16777215,11141282,8696052,16764057,16764057,16764057,16764057,15454147,0,11838,16777215,36799,13158,16777215,16777215,1799573,16777215,3610052,7434613,8092539,5193523,16777215,12566463,16777215,36799,16777215,5287936,13224393,16777215,1137094,65535,255,255,16777215,16777215,192,5193523,13158,0,3506772,13224393,3506772,16777215,16777215,3506772]
[16777215,16777215,0,16777215,192,192,16777215,5263191,2500134,16777215,16777215,16777215,2199221,0,1137094,255,10225233,801923,0,16777215,0,16777215,16777215,0,10086143,10921638,16777215,13158,0,0,0,0,0,0,0,0,0,0,0,0,0,8421504,5395026,4016795,12566463,6740479,36799,0,11352,12874308,16777215,13158,16777215,16777215,16777215,16777215,10086143,16777215,16777215,0,16777215,16777215,16777215,16777215,3770805,11352,10921638,4296113,11838,16777215,16777215,0,16777215,977128,3684410,10017782,10017782,10017782,10017782,0,204,11838,16777215,36799,13158,16777215,16777215,1799573,16777215,3610052,16777215,8092539,5193523,16777215,0,16777215,36799,16777215,5287936,5855577,16777215,1137094,65535,255,255,16777215,16777215,192,5193523,13158,0,2315831,5855577,3506772,0,16777215,3506772]
[16777215,36799,0,16777215,16777215,16777215,24704,8562637,2315831,16777215,16777215,16777215,2199221,16777215,16777215,255,10225233,801923,0,16777215,16777215,16777215,16777215,0,10086143,10921638,16777215,10929378,0,0,0,0,0,0,0,0,0,0,0,0,16777215,8421504,16777215,4016795,12566463,16777215,16777215,16777215,16777215,16777215,16777215,13158,16777215,16777215,16777215,16777215,10086143,16777215,16777215,0,16777215,16777215,16777215,16777215,3770805,16777215,10921638,4296113,11838,16777215,16777215,0,16777215,977128,3684410,10017782,10017782,10017782,10017782,0,204,11838,15134446,16777215,13158,16777215,16777215,0,16777215,3610052,16777215,8092539,5193523,16777215,8421504,16777215,3684410,16777215,4210752,13224393,16777215,6567712,5287936,65535,65535,16777215,16777215,16777215,5193523,13158,0,3506772,3506772,16777215,16777215,16777215,16777215]
[16777215,36799,11352,16777215,9359529,9359529,16777215,16777215,2500134,16777215,16777215,16777215,2199221,14412,16777215,0,16777215,801923,0,16777215,14412,16777215,16777215,13553360,16776960,16777215,16777215,10929378,0,0,0,0,0,0,0,0,0,0,0,0,8421504,3506772,16777215,16777215,16711884,16777215,16777215,16777215,16777215,14412,16777215,0,16777215,65535,16777215,16777215,10086143,16777215,16777215,0,16777215,16777215,16777215,16777215,3175320,16777215,16777215,4296113,11838,16777215,16777215,14412,16777215,16777215,3684410,16777215,16777215,16777215,10017782,16777215,204,11838,15134446,16777215,16777215,16777215,16777215,1799573,16777215,3610052,16777215,8092539,16777215,16777215,8421504,16777215,3684410,16777215,4210752,13224393,16777215,1137094,5287936,65535,65535,16777215,16777215,9359529,16777215,16777215,0,16777215,3506772,16777215,14412,16777215,16777215]
[16777215,36799,16777215,16777215,9359529,9359529,24704,16777215,2500134,16777215,16777215,16777215,16777215,16777215,16777215,16777215,16777215,801923,0,16777215,16777215,16777215,16777215,5855577,0,16777215,16777215,16777215,16728,1281739,16728,15773696,12611584,10498160,10925084,9465920,4525507,1424208,13382400,16764057,8421504,3506772,16777215,16777215,16711884,16777215,16777215,16777215,16777215,16777215,16777215,13158,16777215,65535,16777215,16777215,10086143,16777215,16777215,0,16777215,16777215,16777215,16777215,3770805,16777215,16777215,4296113,11838,16777215,16777215,16777215,16777215,16777215,16777215,16777215,16777215,16777215,10017782,16777215,204,11838,16777215,16777215,0,16777215,16777215,1799573,16777215,16777215,16777215,8092539,0,16777215,8421504,16777215,36799,16777215,16777215,0,16777215,1137094,5287936,5287936,5287936,16777215,16777215,9359529,0,0,1424208,16777215,3506772,16777215,16777215,16777215,16777215]
[16777215,36799,16777215,16777215,9359529,9359529,24704,5263191,4891128,16777215,16777215,16777215,16777215,16777215,16777215,16777215,16777215,801923,0,16777215,16777215,16777215,16777215,16777215,0,16777215,16777215,16777215,6275299,6275299,6275299,6275299,6275299,6275299,6275299,6275299,6275299,6275299,10092543,10092543,16777215,3506772,16777215,16777215,16711680,16777215,16777215,16777215,16777215,16777215,16777215,0,16777215,16711680,16777215,16777215,16777215,16777215,16777215,0,16777215,16777215,16777215,16777215,0,16777215,16777215,4296113,0,16777215,16777215,16777215,16777215,16777215,16777215,16777215,16777215,16777215,10017782,16777215,16777215,0,16777215,16777215,16777215,16777215,16777215,6275299,16777215,16777215,16777215,6740479,16777215,16777215,8421504,16777215,3684410,16777215,16777215,0,16777215,10086143,0,5287936,5287936,16777215,16777215,9359529,16777215,16777215,3506772,16777215,0,16777215,16777215,16777215,16777215]
[16777215,16777215,16777215,16777215,9359529,9359529,10086143,5263191,16777215,16777215,16777215,16777215,16777215,16777215,16777215,16777215,16777215,801923,0,16777215,16777215,16777215,16777215,16777215,0,16777215,16777215,16777215,16777215,16777215,16777215,16777215,16777215,16777215,16777215,16777215,16777215,16777215,16777215,16777215,8421504,3506772,16777215,16777215,16711680,16777215,16777215,16777215,16777215,16777215,16777215,13158,16777215,16711680,16777215,16777215,16777215,16777215,16777215,0,16777215,16777215,16777215,16777215,0,16777215,16777215,4296113,0,16777215,16777215,16777215,16777215,16777215,16777215,16777215,16777215,16777215,10017782,16777215,16777215,0,16777215,16777215,16777215,16777215,16777215,16777215,16777215,16777215,16777215,6740479,16777215,16777215,8421504,16777215,3684410,16777215,16777215,0,16777215,16777215,16777215,5287936,5287936,16777215,16777215,9359529,16777215,16777215,16777215,16777215,0,16777215,16777215,16777215,16777215]
[16777215,16777215,16777215,192,9359529,9359529,16777215,16777215,16777215,16777215,0,16777215,16777215,16777215,16777215,16777215,16777215,16777215,16777215,16777215,16777215,30882,16777215,16777215,0,16777215,16777215,16777215,16777215,16777215,16777215,16777215,16777215,16777215,16777215,16777215,16777215,16777215,16777215,16777215,16777215,16777215,16777215,16777215,16711680,16777215,16777215,0,16777215,16777215,16777215,16777215,5395026,16711680,11389944,16777215,16777215,3243501,16777215,16777215,16777215,16777215,16777215,16777215,16777215,16777215,16777215,16777215,16777215,16777215,16777215,16777215,801923,16777215,16777215,16777215,16777215,16777215,16777215,16777215,16777215,16777215,16777215,16777215,6740479,16777215,801923,16777215,16777215,16777215,16777215,16777215,6740479,16777215,16777215,16777215,16777215,16777215,16777215,0,16777215,16777215,16777215,16777215,16777215,16777215,0,9359529,6740479,6740479,16777215,16777215,0,16777215,3506772,192,16777215]
[16777215,16777215,16777215,192,9359529,9359529,16777215,16777215,16777215,16777215,0,16777215,16777215,16777215,16777215,16777215,16777215,15921906,15921906,16777215,16777215,30882,16777215,16777215,16776960,16777215,16777215,16777215,16777215,16777215,16777215,16777215,16777215,16777215,16777215,16777215,16777215,16777215,16777215,16777215,16777215,16777215,16777215,16777215,16711680,16777215,16777215,0,16777215,16777215,16777215,16777215,5395026,16711680,11389944,13294830,16777215,3243501,16777215,1137094,16777215,16777215,16777215,16777215,0,16777215,16777215,16777215,16777215,16777215,16777215,16777215,801923,16777215,16777215,16777215,16777215,16777215,16777215,16777215,16777215,16777215,16777215,16777215,6740479,1137094,801923,16777215,16777215,16777215,16777215,16777215,6740479,16777215,16777215,16777215,16777215,16777215,16777215,13224393,855309,16777215,16777215,16777215,16777215,16777215,0,9359529,6740479,6740479,16777215,16777215,13224393,16777215,3506772,192,16777215]
[16777215,16777215,16777215,192,5935018,5935018,16777215,16777215,16777215,16777215,0,16777215,16777215,16777215,16777215,16777215,16777215,15921906,15921906,16777215,16777215,30882,16777215,16777215,16777215,16777215,0,16777215,16777215,16777215,16777215,16777215,16777215,16777215,16777215,16777215,16777215,16777215,16777215,16777215,16777215,16777215,16777215,16777215,16711680,204,16777215,0,16777215,16777215,16777215,16777215,5395026,16711680,11389944,13294830,16777215,3243501,16777215,1137094,16777215,16777215,16777215,16777215,11447982,16777215,16777215,16777215,16777215,16777215,16777215,16777215,801923,16777215,8696052,16764057,16764057,16764057,16764057,14726304,16777215,16777215,15921906,16777215,6740479,1137094,801923,16777215,16777215,16777215,7434613,0,6740479,16777215,16777215,16777215,16777215,16777215,16777215,13224393,855309,16777215,16777215,16777215,16777215,16777215,0,5935018,3506772,3506772,16777215,16777215,13224393,16777215,3506772,192,16777215]
[3293276,36799,16777215,192,19816,19816,49407,16777215,16777215,8092539,0,8092539,16777215,16777215,49407,16777215,0,15921906,15921906,293628,16777215,30882,1137094,16777215,16777215,11573124,10498160,16777215,16777215,16777215,16777215,16777215,16777215,16777215,16777215,16777215,16777215,16777215,16777215,16777215,0,16777215,16777215,42752,16711884,204,16777215,855309,16777215,16777215,36799,16777215,5395026,65535,11389944,13158,16777215,3243501,36799,1137094,13408767,16777215,3289655,16777215,11447982,16777215,16777215,16777215,16777215,15921906,36799,16777215,801923,11141282,8696052,16764057,16764057,16764057,16764057,14726304,0,16777215,15921906,16777215,6740479,14083324,801923,16777215,4210752,16777215,7434613,8092539,6740479,36799,0,36799,36799,16777215,16777215,16777215,11389944,16777215,0,0,0,36799,0,19816,2315831,3506772,3506772,36799,16777215,36799,3506772,192,3289655]
[3293276,36799,0,192,19816,19816,49407,8562637,16777215,8092539,0,14277081,16777215,0,49407,3684410,0,3243501,3243501,49407,0,30882,1137094,5855577,16777215,11573124,10498160,16777215,16777215,16777215,16777215,16777215,16777215,16777215,16777215,16777215,16777215,16777215,16777215,16777215,16777215,0,16777215,656128,16737996,204,16777215,8421504,16777215,0,36799,16777215,5395026,584700,13224393,13158,16777215,3243501,36799,1137094,13408767,5395026,3289655,16777215,11447982,16777215,0,16777215,11838,15921906,36799,0,801923,656128,8696052,16764057,5935018,16764057,16764057,3561320,0,11838,16777215,16777215,6740479,1137094,801923,16777215,4210752,16777215,7434613,8092539,6740479,36799,14277081,36799,36799,5395026,16777215,16777215,855309,16777215,8696052,0,0,36799,0,19816,3506772,2315831,3506772,36799,16777215,36799,0,192,3289655]
[3293276,36799,0,192,19816,19816,49407,5263191,16777215,8092539,0,8092539,666680,1137094,49407,3684410,0,15921906,15921906,65535,6740479,30882,1137094,5855577,16777215,11573124,0,16777215,16777215,16777215,16777215,16777215,16777215,16777215,16777215,16777215,16777215,16777215,16777215,16777215,14277081,14277081,16777215,42752,16737996,26367,16777215,0,16777215,801923,36799,16777215,5395026,584700,13224393,13294830,16777215,3243501,36799,1137094,13408767,5395026,3289655,16777215,11447982,16777215,0,16777215,11838,15921906,36799,0,16777215,11141282,8696052,16764057,16764057,16764057,16764057,14726304,0,11838,16777215,16777215,6740479,1137094,7881510,16777215,4210752,16777215,0,8092539,6740479,36799,14277081,36799,36799,5395026,5855577,16777215,855309,16777215,8696052,8696052,8696052,36799,0,19816,3506772,3506772,3506772,36799,16777215,36799,1137094,192,3289655]
[3688550,36799,0,192,19816,19816,49407,5263191,16777215,8092539,0,8092539,666680,6740479,49407,3684410,0,15921906,15921906,5296274,6740479,30882,1137094,5855577,16777215,11573124,0,16777215,16777215,16777215,16777215,16777215,16777215,16777215,16777215,16777215,16777215,16777215,16777215,16777215,14277081,14277081,0,42752,16711884,26367,24704,8421504,16777215,16777215,36799,16777215,5395026,65535,13224393,13294830,801923,3243501,36799,1137094,13408767,5395026,3289655,16777215,11447982,16777215,0,16777215,11838,15921906,36799,0,16777215,11141282,8696052,16764057,16764057,16764057,16764057,14726304,204,11838,16777215,24704,3368601,1137094,7881510,16777215,4210752,16777215,0,8092539,7434613,36799,14277081,2500134,36799,5395026,5287936,16777215,855309,16777215,1137094,1137094,1137094,36799,0,19816,3506772,3506772,3506772,36799,16777215,36799,6740479,192,3289655]
[3688550,36799,0,192,19816,11892015,49407,5263191,16777215,8092539,0,8092539,666680,16777215,49407,3684410,0,15921906,15921906,5287936,16777215,30882,1137094,5855577,16777215,11573124,15652797,16777215,16777215,16777215,16777215,16777215,16777215,16777215,16777215,16777215,16777215,16777215,16777215,16777215,14277081,11573124,0,42752,16777215,204,24704,0,16777215,16777215,36799,13158,5395026,0,13224393,16777215,801923,3243501,36799,1137094,13408767,5395026,3289655,3289655,13311,16777215,0,0,11838,15921906,36799,0,255,11141282,8696052,16764057,16764057,11854022,16764057,14726304,204,11838,16777215,24704,3368601,11389944,7881510,16777215,4210752,16777215,7434613,8092539,7434613,36799,14277081,2500134,36799,5395026,4210752,16777215,855309,16777215,1137094,1137094,1137094,36799,0,11892015,7434613,3368601,3506772,36799,16777215,36799,16777215,192,3289655]
[3688550,36799,0,192,19816,19816,49407,8562637,1137094,8092539,0,8092539,666680,0,0,3684410,0,15921906,15921906,3381555,0,30882,1137094,5855577,16777215,11573124,15652797,10929378,6275299,6275299,6275299,6275299,6275299,6275299,6275299,6275299,6275299,6275299,10092543,10092543,14277081,11573124,5395026,42752,12566463,204,36799,8421504,0,0,36799,12874308,5395026,16777215,13224393,16777215,801923,3243501,36799,1137094,13408767,5395026,3289655,3289655,11447982,0,0,16777215,11838,15921906,36799,0,1137094,11141282,8696052,16764057,5935018,16764057,16764057,3561320,204,11838,16777215,36799,3368601,5855577,0,6275299,4210752,16777215,0,8092539,7434613,36799,14277081,36799,36799,5395026,4210752,16777215,5855577,10086143,1137094,1137094,1137094,36799,3506772,19816,7434613,3368601,6275299,36799,16777215,36799,0,3506772,3289655]
[3688550,36799,11352,0,19816,19816,49407,14083051,801923,8092539,3243501,8092539,666680,16777215,49407,0,0,15921906,15921906,15123099,16777215,19816,1137094,13553360,16777215,11573124,15652797,10929378,6275299,6275299,6275299,6275299,6275299,6275299,6275299,6275299,6275299,6275299,10092543,10092543,14277081,14277081,5395026,42752,12566463,204,36799,15921906,0,16777215,36799,13158,0,16777215,13224393,16777215,801923,3243501,36799,1137094,13408767,5395026,3289655,3289655,11447982,0,10921638,4296113,11838,15921906,36799,14412,1137094,11141282,16777215,16764057,16764057,16764057,16764057,14726304,204,11838,16777215,36799,13158,16777215,0,6275299,4210752,16777215,0,8092539,5193523,36799,14277081,36799,36799,5395026,4210752,16777215,16777215,10086143,1137094,1137094,1137094,36799,3506772,19816,5193523,13158,6275299,36799,16777215,36799,16777215,3506772,3289655]
[1842988,36799,11352,0,19816,19816,49407,14083051,1137094,8092539,3243501,8092539,666680,16777215,49407,0,16777215,15921906,15921906,11892015,16777215,19816,1137094,13553360,16777215,16777215,15652797,10929378,6275299,6275299,6275299,6275299,6275299,6275299,6275299,6275299,6275299,6275299,10092543,10092543,16777215,14277081,5395026,42752,12566463,204,36799,15921906,11352,16777215,36799,13158,0,16777215,13224393,16777215,801923,3243501,36799,1137094,13408767,5395026,3289655,15773696,3770805,0,10921638,4296113,11838,15921906,36799,14412,1137094,11141282,8696052,16764057,16764057,16764057,16764057,14726304,204,11838,16777215,36799,13158,16777215,0,6275299,4210752,16777215,7434613,8092539,5193523,36799,14277081,36799,36799,5395026,5296274,16777215,16777215,10086143,1137094,1137094,1137094,3506772,3243501,19816,5193523,13158,6275299,36799,16777215,36799,16777215,0,3289655]
[1842988,36799,11352,16777215,19816,19816,49407,14083051,2500134,4210752,16777215,4210752,2199221,16777215,49407,0,0,3243501,3243501,10552763,16777215,30882,6740479,13553360,16777215,11573124,0,10929378,16728,1281739,16728,15773696,12611584,10498160,10925084,9465920,4525507,1424208,13382400,16764057,12566463,14277081,5395026,5789690,12566463,204,36799,15921906,11352,16777215,36799,13158,16777215,16777215,13224393,16777215,801923,16777215,36799,1137094,13408767,5395026,3289655,0,3770805,11352,10921638,4296113,11838,15921906,36799,14412,16777215,5789690,8696052,16764057,16764057,16764057,16764057,14726304,204,11838,16777215,36799,13158,16777215,16777215,1799573,4210752,0,7434613,8092539,5193523,36799,12566463,36799,36799,5395026,6740479,16777215,16777215,1137094,0,1137094,1137094,2315831,16777215,19816,5193523,13158,1424208,36799,16777215,36799,16777215,16777215,3289655]
[1842988,24704,11352,16777215,19816,19816,49407,1709849,2500134,4210752,16777215,4210752,2199221,16777215,49407,0,0,801923,0,0,16777215,30882,6740479,13553360,16777215,11573124,10498160,10929378,0,0,0,0,0,0,0,0,0,0,0,0,12566463,12566463,5395026,5789690,12566463,6740479,36799,15921906,11352,16777215,65535,13158,16777215,16777215,13224393,16777215,801923,16777215,0,0,6684927,0,0,0,3770805,11352,10921638,4296113,11838,10053375,24704,14412,16777215,5789690,8696052,16764057,16764057,16764057,16764057,14726304,204,11838,16777215,36799,13158,16777215,16777215,1799573,14277081,0,4210752,8092539,5193523,0,12566463,12611584,36799,0,6740479,16777215,16777215,1137094,255,1137094,1137094,3506772,16777215,19816,5193523,13158,0,0,16777215,3506772,16777215,16777215,0]
[1842988,24704,11352,16777215,192,192,16777215,14083051,2500134,4210752,16777215,4210752,2199221,16777215,1137094,0,10225233,801923,0,0,16777215,30882,6740479,13553360,16764159,10921638,0,13158,0,0,0,0,0,0,0,0,0,0,0,0,12566463,12566463,5395026,5789690,12566463,6740479,36799,15921906,11352,16777215,65535,13158,16777215,16777215,13224393,16777215,10086143,16777215,0,0,6684927,0,0,16777215,3770805,11352,10921638,4296113,11838,10053375,24704,14412,16777215,5789690,8696052,16764057,16764057,16764057,16764057,14726304,204,11838,16777215,36799,13158,16777215,16777215,1799573,14277081,3610052,7434613,8092539,5193523,0,12566463,12611584,36799,0,5287936,13224393,16777215,1137094,255,0,0,0,16777215,192,5193523,13158,0,0,13224393,3506772,16777215,16777215,0]
[1842988,36799,11352,16777215,192,192,24704,1709849,2500134,4210752,16777215,4210752,2199221,16777215,1137094,0,10225233,801923,0,16777215,16777215,30882,6740479,13553360,16776960,10921638,16777215,13158,16728,1281739,16728,15773696,12611584,10498160,10925084,9465920,4525507,1424208,13382400,16764057,0,3506772,5395026,4016795,12566463,6740479,36799,15921906,16777215,16777215,16777215,13158,16777215,16777215,16777215,16777215,10086143,16777215,16777215,0,16777215,16777215,0,16777215,11447982,16777215,10921638,4296113,11838,16777215,16777215,14412,16777215,977128,8696052,10017782,10017782,10017782,5935018,0,204,11838,16777215,36799,13158,16777215,16777215,1799573,16777215,3610052,7434613,8092539,5193523,16777215,0,16777215,36799,16777215,5287936,13224393,16777215,1137094,65535,255,255,16777215,16777215,192,5193523,13158,1424208,3506772,13224393,3506772,16777215,16777215,3506772]
[16777215,36799,11352,16777215,16777215,16777215,16777215,5263191,2500134,4210752,16777215,16777215,2199221,16777215,1137094,0,10225233,801923,0,16777215,16777215,30882,16777215,13553360,10086143,10921638,16777215,10929378,0,0,0,0,0,0,0,0,0,0,0,0,8421504,8421504,5395026,4016795,12566463,6740479,36799,0,16777215,16777215,16777215,0,16777215,16777215,16777215,16777215,10086143,16777215,16777215,0,16777215,16777215,16777215,16777215,11447982,16777215,10921638,4296113,11838,16777215,16777215,14412,16777215,977128,3684410,10017782,10017782,10017782,5935018,0,204,11838,16777215,36799,13158,16777215,16777215,1799573,16777215,3610052,4210752,8092539,5193523,16777215,8421504,16777215,3684410,16777215,855309,5855577,16777215,1137094,65535,255,255,16777215,16777215,16777215,5193523,13158,0,3506772,3506772,16777215,16777215,16777215,3506772]
[16777215,36799,11352,16777215,9359529,9359529,16777215,5263191,2500134,4210752,16777215,16777215,2199221,16777215,1137094,0,10225233,801923,0,16777215,16777215,16777215,16777215,13553360,10086143,10921638,16777215,10929378,0,0,0,0,0,0,0,0,0,0,0,0,0,11854022,16777215,4016795,16711884,6740479,36799,16777215,16777215,16777215,16777215,13158,16777215,65535,16777215,16777215,10086143,16777215,16777215,0,16777215,16777215,16777215,16777215,3770805,16777215,10921638,4296113,11838,16777215,16777215,14412,16777215,977128,3684410,16777215,16777215,16777215,5935018,16777215,204,11838,15134446,36799,13158,16777215,16777215,1799573,16777215,0,7434613,8092539,5193523,16777215,0,16777215,36799,16777215,855309,13224393,16777215,1137094,5287936,65535,65535,16777215,16777215,3506772,5193523,13158,0,16777215,9359529,16777215,16777215,16777215,16777215]
[16777215,36799,11352,16777215,9359529,9359529,16777215,5263191,2500134,16777215,16777215,16777215,16777215,14412,1137094,16777215,10225233,801923,0,16777215,14412,16777215,16777215,13553360,16776960,10921638,16777215,10929378,16728,1281739,16728,15773696,12611584,10498160,10925084,9465920,4525507,1424208,13382400,16764057,8421504,8421504,16777215,16777215,16711884,16777215,16777215,16777215,16777215,14412,16777215,13158,16777215,65535,16777215,16777215,10086143,16777215,16777215,0,16777215,16777215,16777215,16777215,3770805,16777215,16777215,4296113,11838,16777215,16777215,14412,16777215,16777215,3684410,16777215,16777215,16777215,5935018,16777215,204,11838,15921906,16777215,13158,16777215,16777215,1799573,16777215,3610052,7434613,8092539,5193523,16777215,8421504,16777215,36799,16777215,16777215,13224393,16777215,1137094,5287936,65535,65535,16777215,16777215,3506772,5193523,13158,1424208,16777215,3506772,16777215,14412,16777215,16777215]
[16777215,36799,16777215,16777215,9359529,9359529,24704,1709849,16777215,16777215,16777215,16777215,16777215,16777215,16777215,16777215,16777215,801923,0,16777215,16777215,16777215,16777215,16777215,16764159,16777215,16777215,16777215,16777215,16777215,16777215,16777215,16777215,16777215,16777215,16777215,16777215,16777215,16777215,16777215,16777215,5296274,16777215,16777215,16711680,16777215,16777215,16777215,16777215,16777215,16777215,0,16777215,16711680,16777215,16777215,16777215,16777215,16777215,0,16777215,16777215,16777215,16777215,3770805,16777215,16777215,4296113,11838,16777215,16777215,16777215,16777215,16777215,3684410,16777215,16777215,16777215,5935018,16777215,204,11838,15921906,16777215,16777215,16777215,16777215,16777215,16777215,3610052,16777215,8092539,16777215,16777215,8421504,16777215,3684410,16777215,16777215,13224393,16777215,16777215,5287936,5287936,5287936,16777215,16777215,3506772,16777215,16777215,3506772,16777215,13224393,16777215,16777215,16777215,16777215]
[16777215,16777215,16777215,16777215,9359529,9359529,16777215,14083051,16777215,16777215,16777215,16777215,16777215,16777215,16777215,16777215,16777215,801923,0,16777215,16777215,16777215,16777215,16777215,16777215,16777215,16777215,16777215,16777215,16777215,16777215,16777215,16777215,16777215,16777215,16777215,16777215,16777215,16777215,16777215,8421504,5296274,16777215,16777215,16711680,16777215,16777215,16777215,16777215,16777215,16777215,13158,16777215,16711680,16777215,16777215,16777215,16777215,16777215,0,16777215,16777215,16777215,16777215,11447982,16777215,16777215,4296113,0,16777215,16777215,16777215,16777215,16777215,3684410,16777215,16777215,16777215,5935018,16777215,16777215,0,16777215,16777215,16777215,16777215,16777215,16777215,16777215,16777215,16777215,6740479,16777215,16777215,8421504,16777215,3684410,16777215,16777215,13224393,16777215,16777215,0,5287936,5287936,16777215,16777215,9359529,16777215,16777215,3506772,16777215,13224393,16777215,16777215,16777215,16777215]
[16777215,16777215,16777215,192,9359529,9359529,16777215,16777215,16777215,16777215,0,16777215,16777215,16777215,16777215,16777215,16777215,15921906,15921906,16777215,16777215,16777215,16777215,16777215,0,16777215,16777215,16777215,16777215,16777215,16777215,16777215,16777215,16777215,16777215,16777215,16777215,16777215,16777215,16777215,16777215,16777215,16777215,16777215,16711680,16777215,36799,0,16777215,16777215,16777215,16777215,5395026,16711680,11389944,16777215,16777215,3243501,16777215,1137094,16777215,16777215,16777215,16777215,16777215,16777215,16777215,16777215,16777215,16777215,16777215,16777215,801923,16777215,16777215,16777215,16777215,16777215,16777215,16777215,204,16777215,16777215,36799,6740479,1137094,801923,16777215,16777215,16777215,16777215,16777215,6740479,16777215,16777215,16777215,16777215,16777215,16777215,0,855309,16777215,16777215,16777215,16777215,16777215,0,9359529,6740479,6740479,16777215,16777215,0,16777215,3506772,192,16777215]
[16777215,16777215,16777215,192,5935018,16764057,16777215,16777215,16777215,16777215,0,16777215,16777215,16777215,16777215,16777215,16777215,15921906,15921906,16777215,16777215,30882,16777215,16777215,16777215,16777215,0,16777215,16777215,16777215,16777215,16777215,16777215,16777215,16777215,16777215,16777215,16777215,16777215,16777215,16777215,16777215,5395026,16777215,16711680,204,36799,0,16777215,16777215,16777215,16777215,5395026,16711680,11389944,13294830,16777215,3243501,16777215,1137094,16777215,16777215,16777215,16777215,0,16777215,16777215,16777215,16777215,16777215,16777215,16777215,801923,16777215,8696052,16764057,16764057,9359529,16764057,14726304,204,16777215,13553360,36799,6740479,1137094,801923,16777215,16777215,16777215,16777215,16777215,6740479,16777215,16777215,16777215,36799,16777215,16777215,13224393,855309,16777215,16777215,16777215,16777215,16777215,0,16764057,6740479,6740479,16777215,16777215,13224393,16777215,3506772,192,16777215]
[3688550,36799,16777215,192,19816,16764057,49407,16777215,16777215,8092539,0,8092539,16777215,16777215,49407,16777215,16777215,0,0,255,16777215,30882,1137094,16777215,16777215,16777215,15652797,16777215,16777215,16777215,16777215,16777215,16777215,16777215,16777215,16777215,16777215,16777215,16777215,16777215,16777215,16777215,5395026,16777215,16711680,204,36799,0,16777215,16777215,0,16777215,5395026,16711680,11389944,13294830,16777215,3243501,36799,0,13408767,16777215,3289655,16777215,11447982,16777215,16777215,16777215,16777215,15921906,36799,16777215,801923,16777215,8696052,16764057,16764057,9359529,16764057,14726304,204,16777215,16777215,36799,6740479,1137094,801923,16777215,4210752,16777215,4210752,8092539,6740479,36799,16777215,36799,36799,16777215,16777215,16777215,855309,16777215,0,0,0,36799,0,16764057,3506772,3506772,16777215,36799,16777215,36799,3506772,192,3289655]
[3688550,36799,0,192,19816,16764057,49407,16777215,16777215,8092539,0,8092539,666680,0,49407,3684410,16777215,15921906,15921906,293628,0,16777215,1137094,5855577,16777215,16777215,0,13158,16777215,16777215,16777215,16777215,16777215,16777215,16777215,16777215,16777215,16777215,16777215,16777215,0,0,5395026,42752,16711884,26367,36799,0,11352,0,36799,16777215,5395026,65535,11389944,13158,16777215,3243501,36799,1137094,13408767,8092539,3289655,16777215,0,16777215,0,16777215,11838,15921906,36799,0,801923,11141282,8696052,16764057,16764057,9359529,16764057,14726304,204,11838,16777215,36799,3368601,1137094,801923,16777215,4210752,16777215,4210752,8092539,7434613,36799,0,36799,36799,5395026,5855577,16777215,855309,16777215,0,0,0,36799,0,16764057,2315831,3506772,3506772,36799,16777215,36799,3506772,192,3289655]
[3293276,36799,0,192,19816,16764057,49407,14083051,16777215,8092539,0,14277081,666680,6740479,49407,3684410,0,3243501,3243501,49407,6740479,30882,1137094,5855577,16777215,11573124,0,13158,16777215,16777215,16777215,16777215,16777215,16777215,16777215,16777215,16777215,16777215,16777215,16777215,14277081,14277081,5395026,42752,16711884,26367,36799,8421504,11352,801923,36799,16777215,5395026,65535,13224393,13158,16777215,3243501,36799,1137094,13408767,8092539,3289655,16777215,0,16777215,0,16777215,11838,15921906,36799,0,255,11141282,8696052,16764057,16764057,9359529,16764057,14726304,204,11838,16777215,36799,6740479,1137094,7881510,16777215,4210752,16777215,7434613,8092539,6740479,36799,14277081,36799,36799,5395026,5855577,16777215,855309,16777215,8696052,8696052,8696052,36799,0,16764057,3506772,3506772,3506772,36799,16777215,36799,6740479,192,3289655]
[3293276,36799,0,192,19816,16764057,49407,8562637,16777215,8092539,0,8092539,666680,6740479,49407,3684410,0,3243501,3243501,65535,6740479,30882,1137094,5855577,16777215,11573124,15652797,10929378,16777215,16777215,16777215,16777215,16777215,16777215,16777215,16777215,16777215,16777215,16777215,16777215,14277081,14277081,0,42752,16711884,26367,36799,0,11352,801923,36799,16777215,5395026,65535,13224393,13294830,801923,3243501,36799,1137094,13408767,5395026,3289655,3289655,11447982,16777215,0,16777215,11838,15921906,36799,0,255,11141282,8696052,16764057,5935018,9359529,16764057,3561320,204,11838,16777215,36799,6740479,1137094,7881510,16777215,4210752,16777215,0,8092539,6740479,36799,14277081,36799,36799,5395026,4210752,16777215,855309,16777215,0,1137094,1137094,36799,0,16764057,3506772,3506772,3506772,36799,16777215,36799,6740479,192,3289655]
[3688550,36799,0,192,19816,11892015,49407,5263191,855309,8092539,0,8092539,666680,6740479,49407,3684410,0,15921906,15921906,5296274,6740479,30882,1137094,5855577,16777215,11573124,15652797,10929378,16728,1281739,16728,15773696,12611584,10498160,10925084,9465920,4525507,1424208,13382400,16764057,14277081,14277081,0,42752,16711884,26367,36799,8421504,11352,16777215,36799,13158,5395026,65535,13224393,13294830,801923,3243501,36799,1137094,13408767,5395026,3289655,3289655,13311,0,0,4296113,11838,15921906,36799,0,255,11141282,8696052,16764057,16764057,11854022,16764057,14726304,204,11838,16777215,36799,3368601,11389944,7881510,2593979,4210752,16777215,0,8092539,7434613,36799,14277081,36799,36799,5395026,4210752,16777215,855309,801923,1137094,1137094,1137094,36799,0,11892015,3506772,3506772,1424208,36799,16777215,36799,6740479,192,3289655]
[3688550,36799,0,192,19816,19816,49407,8562637,1137094,8092539,0,8092539,666680,0,49407,3684410,0,15921906,15921906,5287936,0,30882,1137094,5855577,16777215,11573124,0,10929378,16728,1281739,16728,15773696,12611584,10498160,10925084,9465920,4525507,1424208,13382400,16764057,16777215,14277081,5395026,42752,16777215,204,36799,8421504,0,0,36799,13158,5395026,0,13224393,13294830,801923,3243501,36799,1137094,13408767,5395026,3289655,3289655,11447982,0,0,4296113,11838,15921906,36799,0,801923,11141282,8696052,16764057,5935018,16764057,16764057,3561320,204,11838,16777215,36799,3368601,1137094,801923,2593979,4210752,16777215,7434613,8092539,7434613,36799,14277081,36799,36799,5395026,16777215,16777215,855309,10086143,1137094,1137094,1137094,36799,0,19816,7434613,3368601,1424208,36799,16777215,36799,0,192,3289655]
[3688550,36799,11352,192,19816,19816,49407,14083051,4891128,8092539,0,12566463,666680,16777215,49407,0,0,15921906,15921906,3381555,16777215,30882,1137094,13553360,16777215,11573124,0,10929378,6275299,6275299,6275299,6275299,6275299,6275299,6275299,6275299,6275299,6275299,10092543,10092543,14277081,14277081,5395026,42752,12566463,204,36799,15921906,0,16777215,36799,13158,5395026,16777215,13224393,13294830,801923,3243501,36799,1137094,13408767,5395026,3289655,0,13311,0,10921638,4296113,11838,15921906,36799,14412,801923,11141282,16777215,16764057,16764057,16764057,16764057,14064512,204,11838,16777215,36799,3368601,11389944,801923,6275299,4210752,16777215,4210752,8092539,7434613,36799,14277081,36799,36799,5395026,16777215,13224393,855309,10086143,1137094,1137094,1137094,36799,3506772,19816,7434613,3368601,6275299,36799,13224393,36799,16777215,3506772,3289655]
[9134290,36799,11352,192,19816,19816,49407,1709849,801923,8092539,0,8092539,666680,16777215,49407,0,16777215,15921906,15921906,15123099,16777215,30882,1137094,13553360,16777215,16777215,15652797,10929378,6275299,6275299,6275299,6275299,6275299,6275299,6275299,6275299,6275299,6275299,10092543,10092543,14277081,14277081,5395026,42752,12566463,204,36799,15921906,11352,16777215,36799,0,5395026,16777215,13224393,16777215,801923,3243501,36799,1137094,13408767,5395026,3289655,15773696,11447982,0,10921638,4296113,11838,15921906,36799,14412,1137094,11141282,16777215,16764057,16764057,16764057,16764057,14064512,204,11838,16777215,36799,13158,5855577,801923,6275299,4210752,16777215,7434613,8092539,5193523,36799,14277081,36799,36799,5395026,16777215,13224393,5855577,10086143,1137094,1137094,1137094,36799,3506772,19816,5193523,13158,6275299,36799,13224393,36799,16777215,3506772,3289655]
[10053375,36799,11352,0,19816,19816,49407,14083051,1137094,8092539,3243501,4210752,666680,16777215,49407,0,0,3243501,3243501,11892015,16777215,30882,6740479,13553360,16777215,11573124,15652797,10929378,6275299,6275299,6275299,6275299,6275299,6275299,6275299,6275299,6275299,6275299,10092543,10092543,14277081,14277081,5395026,42752,12566463,204,36799,15921906,11352,16777215,36799,13158,0,16777215,13224393,16777215,801923,3243501,36799,1137094,13408767,5395026,3289655,3289655,11447982,0,10921638,4296113,11838,15921906,36799,14412,1137094,11141282,8696052,16764057,16764057,16764057,16764057,14064512,204,11838,16382457,36799,13158,5855577,0,6275299,4210752,0,7434613,8092539,5193523,36799,14277081,36799,36799,5395026,4210752,13224393,5855577,10086143,1137094,1137094,1137094,3506772,3243501,19816,5193523,13158,6275299,36799,13224393,36799,16777215,0,3289655]
[1842988,36799,11352,0,19816,19816,49407,1709849,2500134,8092539,3243501,4210752,2199221,16777215,49407,0,0,15921906,15921906,10552763,16777215,30882,6740479,13553360,16777215,11573124,0,10929378,16728,1281739,16728,15773696,12611584,10498160,10925084,9465920,4525507,1424208,13382400,16764057,12566463,14277081,5395026,5789690,12566463,204,36799,0,11352,16777215,36799,13158,0,16777215,13224393,16777215,801923,3243501,36799,1137094,13408767,5395026,3289655,3289655,3770805,11352,10921638,4296113,11838,15921906,36799,14412,1137094,5789690,8696052,16764057,16764057,16764057,16764057,14064512,204,11838,16777215,36799,13158,16777215,0,1799573,4210752,0,7434613,8092539,5193523,36799,12566463,36799,16777215,5395026,5296274,16777215,16777215,1137094,1137094,1137094,1137094,3506772,3243501,19816,5193523,13158,1424208,36799,16777215,36799,16777215,0,3289655]
[1842988,36799,11352,192,19816,19816,49407,1709849,2500134,8092539,0,8092539,2199221,16777215,49407,0,0,801923,0,10689949,16777215,30882,1137094,13553360,16777215,11573124,10498160,10929378,16728,1281739,16728,15773696,12611584,10498160,10925084,9465920,4525507,1424208,13382400,16764057,12566463,12566463,5395026,656128,12566463,6740479,36799,15921906,0,16777215,36799,13158,5395026,16777215,13224393,16777215,801923,3243501,36799,0,13408767,5395026,3289655,0,3770805,0,10921638,4296113,11838,15921906,36799,14412,1137094,656128,8696052,16764057,16764057,16764057,16764057,14064512,204,11838,16777215,36799,13158,16777215,801923,1799573,4210752,3610052,7434613,8092539,5193523,36799,12566463,36799,36799,5395026,6740479,16777215,16777215,1137094,0,1137094,1137094,3506772,0,19816,5193523,13158,1424208,36799,16777215,3506772,16777215,192,3289655]
[1842988,36799,11352,192,192,192,24704,14083051,2500134,8092539,0,4210752,2199221,16777215,1137094,0,0,801923,0,9145333,16777215,30882,6740479,13553360,16777215,11573124,10498160,13158,16728,1281739,16728,15773696,12611584,10498160,10925084,9465920,4525507,1424208,13382400,16764057,0,12566463,5395026,5789690,12566463,6740479,36799,15921906,11352,16777215,36799,16777215,5395026,16777215,13224393,16777215,801923,3243501,36799,0,13408767,0,3289655,0,11447982,11352,10921638,16777215,11838,10053375,36799,14412,801923,5789690,8696052,16764057,16764057,16764057,16764057,14064512,204,11838,16382457,36799,13158,16777215,801923,1799573,14277081,3610052,7434613,8092539,5193523,36799,0,36799,36799,0,6740479,16777215,16777215,1137094,255,1137094,1137094,36799,0,192,5193523,13158,1424208,3506772,16777215,3506772,16777215,192,3506772]
[10053375,36799,11352,192,192,192,49407,1709849,2500134,4210752,0,4210752,2199221,16777215,1137094,0,10225233,801923,0,5263615,16777215,30882,6740479,13553360,16764159,10921638,0,13158,16728,1281739,16728,15773696,12611584,10498160,10925084,9465920,4525507,1424208,13382400,16764057,16777215,11854022,5395026,42752,12566463,6740479,36799,15921906,11352,16777215,36799,16777215,5395026,16777215,16777215,16777215,801923,3243501,36799,0,13408767,0,0,16777215,11447982,11352,10921638,16777215,11838,16777215,36799,14412,801923,11141282,8696052,16764057,16764057,16764057,16764057,14064512,204,11838,16777215,36799,3368601,16777215,801923,1799573,4210752,3610052,7434613,8092539,7434613,36799,14277081,36799,36799,0,5287936,13224393,16777215,1137094,255,0,0,36799,0,192,7434613,3368601,1424208,3506772,13224393,3506772,16777215,192,3506772]
[9134290,36799,11352,192,16777215,16777215,49407,14083051,2500134,4210752,0,4210752,2199221,16777215,1137094,0,10225233,801923,0,293628,16777215,30882,6740479,13553360,16776960,10921638,16777215,10929378,16728,1281739,16728,15773696,12611584,10498160,10925084,9465920,4525507,1424208,13382400,16764057,0,8421504,5395026,4016795,12566463,6740479,36799,15921906,16777215,16777215,36799,16777215,5395026,16777215,16777215,16777215,801923,3243501,36799,0,13408767,5395026,0,16777215,11447982,16777215,10921638,16777215,11838,16777215,36799,14412,801923,977128,8696052,10017782,10017782,10017782,10017782,0,204,11838,16777215,36799,13158,16777215,801923,1799573,4210752,3610052,4210752,8092539,5193523,36799,0,12611584,36799,5395026,5287936,13224393,16777215,1137094,65535,255,255,36799,0,16777215,5193523,13158,1424208,2315831,3506772,36799,16777215,192,3506772]
[3688550,36799,11352,16777215,9359529,9359529,49407,14083051,2500134,8092539,16777215,4210752,2199221,16777215,1137094,0,10225233,801923,0,49407,16777215,30882,6740479,13553360,16776960,10921638,16777215,10929378,16728,1281739,16728,15773696,12611584,10498160,10925084,9465920,4525507,1424208,13382400,16764057,14277081,8421504,3684410,4016795,16711884,6740479,36799,0,16777215,16777215,36799,13158,16777215,65535,16777215,16777215,10086143,16777215,36799,0,13408767,5395026,3289655,16777215,11447982,16777215,10921638,16777215,11838,16777215,36799,14412,16777215,977128,3684410,16777215,16777215,16777215,10017782,16777215,204,11838,16777215,36799,13158,16777215,16777215,1799573,4210752,3610052,7434613,8092539,5193523,36799,14277081,36799,36799,5395026,855309,5855577,16777215,1137094,65535,255,255,36799,16777215,3506772,5193523,13158,1424208,36799,9359529,36799,16777215,16777215,3289655]
[3688550,36799,11352,16777215,9359529,9359529,49407,1709849,16777215,8092539,16777215,4210752,16777215,14412,1137094,0,10225233,801923,0,65535,14412,19816,6740479,13553360,16764159,10921638,16777215,10929378,16728,1281739,16728,15773696,12611584,10498160,10925084,9465920,4525507,1424208,13382400,16764057,0,8421504,16777215,4016795,16711884,6740479,36799,16777215,16777215,14412,36799,0,16777215,65535,16777215,16777215,10086143,16777215,36799,0,13408767,5395026,3289655,16777215,11447982,16777215,16777215,16777215,11838,16777215,36799,14412,16777215,977128,3684410,16777215,16777215,16777215,10017782,16777215,204,11838,16777215,36799,13158,1137094,16777215,1799573,4210752,3610052,7434613,8092539,5193523,36799,0,36799,3684410,5395026,855309,13224393,855309,1137094,5287936,65535,65535,36799,16777215,3506772,5193523,13158,1424208,36799,3506772,36799,14412,16777215,3289655]
[3688550,36799,16777215,16777215,9359529,9359529,16777215,1709849,16777215,8092539,16777215,4210752,16777215,16777215,1137094,16777215,10225233,801923,0,5296274,16777215,19816,6740479,16777215,16777215,10921638,16777215,7998,16777215,16777215,16777215,16777215,16777215,16777215,16777215,16777215,16777215,16777215,16777215,16777215,8421504,8421504,16777215,16777215,16711680,16777215,36799,16777215,16777215,16777215,36799,13158,16777215,16711680,16777215,16777215,10086143,16777215,36799,0,13408767,5395026,3289655,16777215,11447982,16777215,16777215,16777215,11838,16777215,36799,16777215,16777215,16777215,3684410,16777215,16777215,16777215,10017782,16777215,204,11838,15921906,36799,13158,16777215,16777215,16777215,4210752,3610052,7434613,8092539,5193523,36799,8421504,36799,3684410,5395026,16777215,13224393,16777215,16777215,5287936,65535,65535,36799,16777215,3506772,5193523,13158,3506772,36799,13224393,36799,16777215,16777215,3289655]
[16777215,16777215,16777215,16777215,9359529,9359529,16777215,14083051,16777215,8092539,16777215,4210752,16777215,16777215,1137094,16777215,10225233,801923,0,16777215,16777215,16777215,6740479,16777215,16777215,10921638,16777215,16777215,16777215,16777215,16777215,16777215,16777215,16777215,16777215,16777215,16777215,16777215,16777215,16777215,8421504,11854022,16777215,16777215,16711680,16777215,16777215,16777215,16777215,16777215,16777215,13158,16777215,16711680,16777215,16777215,16777215,16777215,16777215,0,16777215,16777215,16777215,16777215,11447982,16777215,16777215,16777215,11838,16777215,16777215,16777215,16777215,16777215,3684410,16777215,16777215,16777215,10017782,16777215,204,11838,15921906,16777215,16777215,16777215,16777215,16777215,16777215,3610052,7434613,6740479,16777215,16777215,8421504,16777215,3684410,16777215,16777215,13224393,16777215,16777215,0,5287936,5287936,16777215,16777215,9359529,16777215,16777215,3506772,16777215,13224393,16777215,16777215,16777215,16777215]
[16777215,16777215,16777215,16777215,5878757,16772300,16777215,16777215,16777215,16777215,16777215,16777215,16777215,16777215,16777215,16777215,16777215,15921906,15921906,16777215,16777215,16777215,16777215,16777215,0,16777215,0,16777215,16728,1281739,16728,15773696,12611584,10498160,10925084,9465920,4525507,1424208,13382400,16764057,16777215,16777215,16777215,16777215,16711680,204,36799,0,11352,16777215,16777215,16777215,16777215,16711680,11389944,13158,16777215,16777215,16777215,1137094,16777215,16777215,16777215,16777215,16777215,11352,16777215,16777215,16777215,16777215,16777215,16777215,16777215,16777215,16777215,16769217,16769217,11854022,16769217,10954261,204,16777215,16777215,36799,6740479,14083324,16777215,16777215,16777215,16777215,16777215,16777215,6740479,16777215,16777215,16777215,0,16777215,16777215,0,14083324,16777215,16777215,16777215,16777215,16777215,16777215,16772300,6740479,6740479,1424208,16777215,0,16777215,3506772,16777215,16777215]
[16777215,36799,16777215,192,5878757,16772300,16777215,16777215,16777215,8092539,0,8092539,16777215,16777215,49407,16777215,16777215,15921906,15921906,5263615,16777215,16777215,1137094,16777215,16777215,16777215,15652797,10929378,16728,1281739,16728,15773696,12611584,10498160,10925084,9465920,4525507,1424208,13382400,16764057,16777215,16777215,5395026,16777215,16711680,204,36799,0,11352,16777215,36799,16777215,5395026,16711680,11389944,13294830,16777215,3243501,36799,1137094,13408767,16777215,3289655,16777215,0,11352,16777215,16777215,16777215,15921906,36799,16777215,801923,16777215,8696052,16769217,16769217,11854022,16769217,10954261,204,16777215,13553360,36799,6740479,1137094,801923,16777215,4210752,16777215,16777215,8092539,6740479,36799,16777215,36799,0,16777215,16777215,13224393,855309,16777215,0,0,0,36799,0,16772300,6740479,6740479,1424208,36799,13224393,36799,3506772,192,3289655]
[3688550,36799,0,192,5878757,16772300,49407,16777215,16777215,8092539,0,8092539,16777215,0,0,3684410,16777215,15921906,15921906,255,0,16777215,1137094,5855577,16777215,16777215,15652797,13158,16728,1281739,16728,15773696,12611584,10498160,10925084,9465920,4525507,1424208,13382400,16764057,0,16777215,5395026,16777215,16777215,26367,36799,0,11352,801923,36799,16777215,5395026,0,11389944,13294830,16777215,3243501,36799,1137094,13408767,8092539,3289655,16777215,0,11352,0,16777215,16777215,15921906,36799,0,801923,16777215,801923,16769217,16769217,11854022,16769217,10954261,204,16777215,16777215,36799,6740479,1137094,801923,16777215,4210752,16777215,0,8092539,6740479,36799,0,36799,36799,5395026,5855577,16777215,855309,16777215,0,0,0,36799,0,16772300,3506772,3506772,1424208,36799,16777215,36799,3506772,192,3289655]
[3688550,36799,0,16777215,5878757,16772300,49407,16777215,16777215,8092539,16777215,8092539,666680,6740479,49407,3684410,16777215,15921906,15921906,293628,6740479,16777215,1137094,5855577,255,16777215,15652797,13158,16728,1281739,16728,15773696,12611584,10498160,10925084,9465920,4525507,1424208,13382400,16764057,14277081,0,5395026,16777215,16777215,26367,36799,15921906,11352,801923,36799,16777215,16777215,0,11389944,13158,16777215,16777215,36799,1137094,13408767,8092539,3289655,16777215,4539865,11352,0,16777215,0,15921906,36799,0,16777215,16777215,8696052,16769217,16769217,11854022,16769217,10954261,204,0,7434613,36799,3368601,16777215,16777215,16777215,4210752,16777215,0,8092539,7434613,36799,14277081,36799,36799,5395026,4210752,255,16777215,16777215,8696052,8696052,8696052,36799,16777215,16772300,3506772,3506772,3506772,36799,255,36799,3506772,16777215,3289655]
[3688550,36799,0,16777215,19816,16772300,49407,8562637,855309,8092539,16777215,8092539,666680,1137094,49407,3684410,0,15921906,15921906,49407,6740479,16777215,1137094,5855577,16777215,11573124,15652797,13158,16728,1281739,16728,15773696,12611584,10498160,10925084,9465920,4525507,1424208,13382400,16764057,16777215,14277081,5395026,42752,16777215,26367,36799,15921906,11352,801923,36799,16777215,16777215,0,13224393,13158,16777215,16777215,36799,1137094,13408767,8092539,3289655,3289655,4539865,11352,0,16777215,11838,15921906,36799,0,16777215,11141282,8696052,16764057,16764057,11854022,16764057,9325614,204,11838,16777215,36799,6740479,16777215,16777215,2593979,4210752,3610052,0,8092539,6740479,36799,14277081,36799,36799,5395026,4210752,16777215,16777215,801923,1137094,1137094,1137094,36799,3506772,16772300,3506772,3506772,3506772,36799,16777215,36799,1137094,3506772,3289655]
[3688550,36799,0,192,19816,16764057,49407,5263191,855309,8092539,0,8092539,666680,6740479,49407,3684410,0,3243501,3243501,65535,6740479,30882,1137094,5855577,16777215,11573124,15652797,10929378,16728,1281739,16728,15773696,12611584,10498160,10925084,9465920,4525507,1424208,13382400,16764057,14277081,14277081,5395026,42752,16777215,26367,36799,15921906,11352,16777215,36799,13158,5395026,0,13224393,13294830,801923,3243501,36799,1137094,13408767,8092539,3289655,3289655,0,0,0,4296113,11838,15921906,36799,0,801923,11141282,8696052,16764057,16764057,9359529,16764057,9325614,204,11838,16777215,36799,3368601,1137094,801923,2593979,4210752,3610052,0,8092539,7434613,36799,14277081,36799,36799,5395026,16777215,16777215,855309,801923,1137094,1137094,1137094,36799,0,16764057,3506772,3506772,3506772,36799,16777215,36799,6740479,192,3289655]
[3688550,36799,0,192,19816,19816,49407,5263191,801923,8092539,0,8092539,666680,16777215,49407,3684410,0,3243501,3243501,5296274,16777215,30882,1137094,5855577,16777215,11573124,15652797,10929378,16728,1281739,16728,15773696,12611584,10498160,10925084,9465920,4525507,1424208,13382400,16764057,14277081,14277081,5395026,42752,16777215,26367,36799,0,11352,16777215,36799,0,5395026,0,13224393,13294830,801923,3243501,36799,1137094,13408767,5395026,3289655,3289655,11447982,0,0,4296113,11838,16777215,36799,0,801923,11141282,8696052,16764057,5935018,16764057,16764057,3561320,204,11838,16777215,36799,3368601,1137094,801923,6275299,4210752,3610052,0,8092539,7434613,36799,14277081,36799,1137094,5395026,16777215,16777215,855309,10086143,1137094,1137094,1137094,36799,0,19816,2315831,2315831,1424208,36799,16777215,36799,16777215,192,3289655]
[3688550,36799,0,192,19816,19816,49407,5263191,1137094,8092539,0,14277081,666680,0,49407,3684410,0,3243501,3243501,5287936,0,30882,1137094,5855577,0,11573124,0,10929378,6275299,6275299,6275299,6275299,6275299,6275299,6275299,6275299,6275299,6275299,10092543,10092543,14277081,14277081,5395026,42752,16777215,26367,36799,15921906,0,0,36799,0,5395026,0,14408667,13294830,801923,3243501,36799,1137094,13408767,5395026,3289655,3289655,0,0,0,4296113,11838,16777215,36799,0,801923,11141282,16777215,16764057,16764057,16764057,16764057,9325614,204,11838,15921906,36799,3368601,11389944,801923,6275299,16777215,3610052,7434613,14083324,7434613,36799,14277081,36799,36799,5395026,16777215,0,855309,10086143,1137094,1137094,1137094,36799,3506772,19816,7434613,3368601,6275299,36799,0,36799,0,3506772,3289655]
[16777215,36799,11352,192,19816,19816,49407,8562637,4891128,8092539,0,14277081,666680,16777215,49407,0,0,3243501,3243501,16777215,16777215,30882,1137094,13553360,0,11573124,0,10929378,6275299,6275299,6275299,6275299,6275299,6275299,6275299,6275299,6275299,6275299,10092543,10092543,12566463,14277081,5395026,16777215,12566463,204,36799,0,16777215,16777215,16777215,0,5395026,16777215,14408667,13294830,801923,3243501,16777215,1137094,16777215,16777215,16777215,15773696,0,0,10921638,4296113,11838,16777215,16777215,14412,801923,16777215,16777215,16764057,16764057,16764057,16764057,9325614,204,11838,15921906,36799,3368601,1137094,801923,6275299,16777215,3610052,4210752,8092539,7434613,16777215,12566463,16777215,36799,16777215,16777215,0,855309,10086143,1137094,1137094,1137094,3506772,3506772,19816,7434613,3368601,6275299,3506772,0,3506772,16777215,3506772,3506772]
[10053375,36799,11352,192,9359529,9359529,49407,1709849,801923,8092539,0,8092539,666680,16764159,49407,0,16777215,3243501,3243501,15123099,16777215,30882,1137094,13553360,16777215,16777215,15652797,10929378,6275299,6275299,6275299,6275299,6275299,6275299,6275299,6275299,6275299,6275299,10092543,10092543,12566463,14277081,5395026,42752,12566463,204,36799,15921906,16777215,16777215,36799,13158,5395026,16777215,14408667,13294830,801923,3243501,36799,1137094,13408767,5395026,3289655,3289655,13311,11352,10921638,4296113,11838,15921906,36799,14412,801923,11141282,16777215,16777215,16777215,16777215,16777215,16777215,204,11838,16777215,36799,13158,11389944,801923,6275299,4210752,3610052,7434613,8092539,5193523,36799,12566463,36799,36799,5395026,16777215,13224393,855309,10086143,1137094,1137094,1137094,3506772,0,9359529,5193523,13158,6275299,36799,13224393,36799,16764159,192,3289655]
[10053375,36799,11352,192,19816,19816,49407,14083051,1137094,8092539,0,8092539,666680,16764159,49407,0,0,15921906,15921906,11892015,16777215,30882,1137094,13553360,16777215,11573124,15652797,10929378,6275299,6275299,6275299,6275299,6275299,6275299,6275299,6275299,6275299,6275299,10092543,10092543,12566463,14277081,5395026,42752,12566463,204,36799,0,11352,16777215,36799,13158,5395026,16777215,14408667,13294830,801923,3243501,36799,1137094,13408767,5395026,3289655,3289655,11447982,11352,10921638,4296113,16777215,15921906,36799,14412,801923,11141282,8696052,16764057,16764057,16764057,16764057,9325614,204,16777215,16777215,36799,13158,1137094,801923,6275299,4210752,3610052,4210752,8092539,5193523,36799,12566463,36799,16777215,5395026,4210752,13224393,855309,10086143,1137094,1137094,1137094,2315831,0,19816,5193523,13158,6275299,36799,13224393,36799,16764159,192,3289655]
[10053375,36799,11352,192,19816,19816,49407,1709849,2500134,8092539,0,14277081,1799573,16777215,49407,0,0,15921906,15921906,10552763,16777215,30882,1137094,13553360,16777215,11573124,0,10929378,16728,1281739,16728,15773696,12611584,10498160,10925084,9465920,4525507,1424208,13382400,16764057,0,12566463,16777215,5789690,12566463,204,16777215,0,11352,801923,36799,13158,5395026,16777215,14408667,13294830,801923,3243501,36799,1137094,13408767,5395026,3289655,3289655,13311,11352,10921638,4296113,16777215,15921906,36799,14412,801923,5789690,8696052,16764057,16764057,16764057,16764057,9325614,16777215,16777215,16777215,16777215,13158,11389944,801923,1799573,4210752,3610052,7434613,8092539,5193523,36799,0,36799,16777215,5395026,5296274,13224393,855309,1137094,1137094,801923,801923,3506772,0,19816,5193523,13158,1424208,36799,13224393,36799,16777215,192,3289655]
[1842988,36799,11352,192,19816,19816,24704,14083051,2500134,8092539,0,14277081,2199221,16777215,49407,0,0,15921906,15921906,10689949,16777215,30882,1137094,13553360,16777215,11573124,10498160,10929378,16728,1281739,16728,15773696,12611584,10498160,10925084,9465920,4525507,1424208,13382400,16764057,0,12566463,5395026,5789690,12566463,204,36799,0,11352,16777215,36799,13158,5395026,16777215,14408667,13294830,801923,3243501,36799,1137094,13408767,5395026,3289655,3289655,11447982,11352,3684410,4296113,11838,15921906,36799,14412,801923,5789690,8696052,16764057,16764057,16764057,16764057,9325614,16777215,11838,16777215,36799,13158,1137094,801923,1799573,4210752,3610052,7434613,8092539,5193523,36799,0,36799,36799,5395026,5296274,16777215,855309,1137094,1137094,1137094,1137094,3506772,0,19816,5193523,13158,1424208,36799,16777215,3506772,16777215,192,3289655]
[10053375,36799,11352,192,192,192,49407,14083051,2500134,8092539,0,4210752,2199221,16777215,1137094,0,0,801923,0,9145333,16777215,30882,6740479,13553360,16777215,11573124,10498160,13158,16728,1281739,16728,15773696,12611584,10498160,10925084,9465920,4525507,1424208,13382400,16764057,14277081,12566463,5395026,5789690,5855577,204,36799,15921906,11352,801923,36799,16777215,5395026,16777215,13224393,13294830,801923,3243501,36799,0,13408767,5395026,3289655,0,11447982,11352,3684410,16777215,11838,15921906,36799,14412,801923,5789690,8696052,16764057,16764057,16764057,16764057,9325614,204,11838,16777215,36799,13158,11389944,801923,1799573,4210752,3610052,4210752,8092539,5193523,36799,14277081,36799,36799,5395026,6740479,16777215,855309,1137094,0,1137094,1137094,36799,0,192,5193523,13158,1424208,3506772,16777215,3506772,16777215,192,3506772]
[10053375,36799,11352,192,192,192,49407,1709849,2500134,8092539,0,4210752,2199221,16777215,49407,0,10225233,801923,0,5263615,16777215,30882,6740479,13553360,16777215,10921638,10498160,13158,16728,1281739,16728,15773696,12611584,10498160,10925084,9465920,4525507,1424208,13382400,16764057,16777215,3506772,5395026,42752,12566463,6740479,36799,15921906,11352,16777215,36799,16777215,5395026,16777215,13224393,13158,801923,3243501,36799,0,13408767,5395026,3289655,0,11447982,11352,10921638,16777215,11838,15921906,36799,14412,801923,11141282,8696052,16764057,16764057,16764057,16764057,9325614,204,11838,16777215,36799,3368601,16777215,801923,1799573,4210752,3610052,7434613,8092539,7434613,192,14277081,36799,36799,5395026,6740479,16777215,16777215,1137094,255,1137094,1137094,36799,0,192,7434613,3368601,1424208,3506772,3506772,3506772,16777215,192,3506772]
[10053375,36799,11352,192,16777215,16777215,49407,14083051,2500134,8092539,0,4210752,2199221,16777215,1137094,0,10225233,801923,0,293628,16777215,30882,6740479,13553360,16764159,10921638,0,10929378,16728,1281739,16728,15773696,12611584,10498160,10925084,9465920,4525507,1424208,13382400,16764057,16777215,8421504,5395026,42752,12566463,6740479,36799,15921906,11352,16777215,36799,16777215,5395026,16777215,16777215,6966,801923,3243501,36799,0,13408767,5395026,3289655,0,12566463,11352,10921638,16777215,11838,15921906,36799,14412,801923,11141282,8696052,10017782,10017782,10017782,5935018,0,204,11838,16777215,36799,3368601,16777215,801923,1799573,4210752,3610052,7434613,8092539,7434613,192,14277081,12611584,36799,5395026,855309,13224393,16777215,1137094,255,0,0,36799,0,16777215,7434613,3368601,1424208,2315831,3506772,36799,16777215,192,3506772]
[3688550,36799,11352,192,16777215,16777215,49407,14083051,2500134,8092539,0,4210752,1799573,16764159,49407,0,10225233,801923,0,49407,16777215,30882,6740479,13553360,16764159,10921638,16777215,10929378,16728,1281739,16728,15773696,12611584,10498160,10925084,9465920,4525507,1424208,13382400,16764057,14277081,3506772,3684410,4016795,16711680,6740479,36799,15921906,11352,16777215,36799,16777215,5395026,16711680,16777215,6966,801923,3243501,36799,0,13408767,5395026,3289655,16777215,12566463,11352,10921638,16777215,11838,15921906,36799,14412,801923,977128,3684410,10017782,5935018,10017782,5935018,3561320,204,11838,16777215,36799,3368601,1137094,801923,1799573,4210752,3610052,7434613,8092539,7434613,192,14277081,36799,36799,5395026,5287936,13224393,855309,1137094,65535,255,255,36799,0,16777215,7434613,3368601,1424208,192,3506772,36799,16764159,192,3289655]
[3688550,36799,11352,0,9359529,9359529,49407,1709849,16777215,8092539,3243501,4210752,16777215,14412,1137094,0,10225233,801923,0,65535,14412,19816,6740479,13553360,16777215,10921638,16777215,10929378,16728,1281739,16728,15773696,12611584,10498160,10925084,9465920,4525507,1424208,13382400,16764057,0,8421504,3684410,4016795,16711680,6740479,36799,0,16777215,14412,36799,16777215,0,16711680,16777215,13294830,10086143,192,36799,0,13408767,5395026,3289655,16777215,12566463,16777215,16777215,16777215,11838,15921906,36799,14412,1137094,977128,3684410,16777215,16777215,16777215,5935018,16777215,204,11838,16777215,36799,13158,16777215,0,16777215,4210752,3610052,4210752,8092539,5193523,36799,0,36799,3684410,5395026,855309,5855577,16777215,16777215,65535,255,255,36799,3243501,3506772,5193523,13158,1424208,36799,3506772,36799,14412,0,3289655]
[3688550,36799,16777215,0,9359529,9359529,49407,1709849,16777215,8092539,3243501,4210752,16777215,16777215,49407,16777215,10225233,801923,0,5296274,16777215,19816,6740479,16777215,16777215,10921638,16777215,7998,16777215,16777215,16777215,16777215,16777215,16777215,16777215,16777215,16777215,16777215,16777215,16777215,8421504,8421504,16777215,16777215,16711680,6740479,36799,16777215,16777215,16777215,36799,13158,0,16711680,16777215,16777215,10086143,192,36799,0,13408767,5395026,3289655,16777215,11447982,16777215,16777215,16777215,11838,15921906,36799,16777215,1137094,16777215,3684410,16777215,16777215,16777215,5935018,16777215,204,11838,16777215,36799,13158,16777215,0,16777215,4210752,3610052,7434613,8092539,5193523,36799,8421504,36799,3684410,5395026,16777215,13224393,16777215,16777215,5287936,65535,65535,36799,3243501,3506772,5193523,13158,3506772,36799,13224393,36799,16777215,0,3289655]
[16777215,16777215,16777215,16777215,9359529,9359529,49407,14083051,16777215,8092539,16777215,4210752,16777215,16777215,1137094,16777215,10225233,3243501,3243501,16777215,16777215,19816,6740479,16777215,16777215,10921638,16777215,16777215,16777215,16777215,16777215,16777215,16777215,16777215,16777215,16777215,16777215,16777215,16777215,16777215,8421504,8421504,16777215,16777215,16711680,6740479,16777215,16777215,16777215,16777215,16777215,0,16777215,16711680,16777215,16777215,16777215,16777215,16777215,0,16777215,16777215,16777215,16777215,11447982,16777215,16777215,16777215,11838,16777215,16777215,16777215,16777215,16777215,3684410,16777215,16777215,16777215,5935018,16777215,204,11838,16777215,16777215,13158,16777215,16777215,16777215,16777215,3610052,7434613,6740479,5193523,16777215,8421504,16777215,3684410,16777215,16777215,16777215,16777215,16777215,0,65535,65535,16777215,16777215,3506772,5193523,13158,3506772,16777215,16777215,16777215,16777215,16777215,16777215]
[16777215,16777215,16777215,16777215,5878757,16772300,16777215,16777215,855309,16777215,16777215,16777215,1799573,16777215,16777215,16777215,16777215,16777215,16777215,16777215,16777215,16777215,16777215,16777215,16777215,16777215,0,10929378,16728,1281739,16728,15773696,12611584,10498160,10925084,9465920,4525507,1424208,13382400,16764057,16777215,16777215,16777215,16777215,16711680,204,36799,0,11352,16777215,16777215,16777215,16777215,16711680,11389944,6966,16777215,16777215,16777215,16777215,16777215,16777215,16777215,16777215,16777215,11352,16777215,16777215,16777215,16777215,16777215,16777215,16777215,16777215,16777215,16769217,16769217,11854022,16769217,10954261,204,16777215,16777215,36799,3368601,1137094,16777215,2593979,16777215,16777215,16777215,16777215,7434613,16777215,16777215,16777215,36799,16777215,16777215,16777215,855309,801923,16777215,16777215,16777215,16777215,16777215,16772300,7434613,3368601,1424208,16777215,16777215,16777215,3506772,16777215,16777215]
[3293276,36799,0,16777215,5878757,16772300,16777215,16777215,855309,8092539,16777215,8092539,1799573,0,49407,3684410,16777215,10921638,10921638,5263615,0,16777215,1137094,5855577,0,16777215,10855845,10929378,16728,1281739,16728,15773696,12611584,10498160,10925084,9465920,4525507,1424208,13382400,16764057,16777215,16777215,5395026,16777215,16777215,204,36799,0,11352,0,36799,16777215,16777215,0,11389944,13158,16777215,16777215,36799,1137094,13408767,16777215,3289655,16777215,16777215,11352,0,16777215,16777215,16777215,36799,0,16777215,16777215,801923,16769217,16769217,11854022,16769217,10954261,204,16777215,13553360,36799,6740479,1137094,16777215,2593979,16777215,16777215,16777215,8092539,6740479,36799,16777215,36799,36799,16777215,16777215,0,855309,801923,0,0,13434828,36799,16777215,16772300,6740479,6740479,1424208,36799,0,36799,3506772,16777215,3289655]
[13421823,24704,0,16777215,13431551,16772300,49407,16777215,855309,2500134,16777215,2500134,1799573,0,49407,3684410,16777215,15921906,15921906,24704,0,16777215,24704,5855577,255,16777215,15652797,13158,16728,1281739,16728,15773696,12611584,10498160,10925084,9465920,4525507,1424208,13382400,16764057,0,16777215,5395026,16777215,16777215,26367,36799,15921906,11352,0,24704,16777215,16777215,0,11389944,13158,16777215,16777215,24704,1137094,6684927,8092539,0,16777215,16777215,11352,0,16777215,16777215,12566463,16777215,0,16777215,16777215,801923,16777215,16777215,11854022,16777215,16777215,204,16777215,7434613,36799,3368601,16777215,16777215,2593979,24704,16777215,16777215,8092539,7434613,24704,0,2500134,36799,5395026,16777215,255,16777215,801923,8696052,8696052,8696052,24704,16777215,16772300,3506772,3506772,1424208,24704,255,16777215,3506772,16777215,0]
[3293276,36799,0,16777215,5878757,16772300,49407,16777215,855309,8092539,16777215,8092539,666680,6740479,49407,3684410,0,3243501,3243501,293628,6740479,16777215,1137094,5855577,16777215,11573124,15652797,13158,16728,1281739,16728,15773696,12611584,10498160,10925084,9465920,4525507,1424208,13382400,16764057,11389944,0,5395026,16777215,16777215,0,36799,15921906,11352,801923,36799,16777215,16777215,0,11389944,13158,16777215,16777215,36799,1137094,13408767,0,3289655,3289655,4539865,11352,0,16777215,16777215,15921906,36799,0,16777215,16777215,8696052,16769217,16769217,11854022,16769217,10954261,204,16777215,7434613,36799,3368601,16777215,16777215,2593979,4210752,3610052,0,8092539,7434613,36799,49407,36799,36799,0,16777215,16777215,16777215,801923,8696052,1137094,1137094,36799,16777215,16772300,3506772,2315831,3506772,36799,16777215,36799,3506772,16777215,3289655]
[3293276,36799,0,16777215,19816,16772300,36799,14083051,855309,8092539,16777215,8092539,666680,1137094,49407,3684410,0,3243501,3243501,49407,6740479,16777215,11389944,5855577,16777215,11573124,10855845,13158,16728,1281739,16728,15773696,12611584,10498160,10925084,9465920,4525507,1424208,13382400,16764057,14277081,14277081,5395026,16777215,16777215,26367,36799,0,11352,801923,36799,16777215,16777215,0,13224393,13158,801923,16777215,36799,1137094,13408767,8092539,3289655,3289655,0,11352,0,16777215,11838,16777215,36799,0,16777215,16777215,8696052,16764057,16764057,11854022,16764057,13005646,204,11838,16777215,36799,3368601,16777215,16777215,2593979,4210752,3610052,0,8092539,7434613,36799,14277081,36799,36799,5395026,16777215,16777215,16777215,801923,1137094,1137094,1137094,36799,3506772,16772300,3506772,3506772,3506772,36799,16777215,36799,1137094,3506772,3289655]
[3688550,36799,0,16777215,19816,16764057,49407,8562637,1137094,8092539,16777215,12566463,666680,6740479,49407,3684410,0,15921906,15921906,65535,6740479,30882,11389944,5855577,0,11573124,15652797,10929378,6275299,6275299,6275299,6275299,6275299,6275299,6275299,6275299,6275299,6275299,10092543,10092543,14277081,14277081,5395026,42752,16777215,0,36799,15921906,11352,16777215,36799,0,16777215,0,13224393,13294830,801923,16777215,36799,1137094,13408767,8092539,3289655,3289655,11447982,0,0,4296113,11838,16777215,36799,0,16777215,11141282,8696052,16764057,5935018,9359529,16764057,3561320,204,11838,15921906,36799,3368601,16777215,16777215,6275299,16777215,3610052,16777215,8092539,7434613,36799,14277081,36799,1137094,5395026,16777215,0,16777215,10086143,1137094,1137094,1137094,36799,3506772,16764057,3506772,3506772,6275299,36799,0,36799,6740479,3506772,3289655]
[16777215,36799,0,192,19816,19816,49407,5263191,801923,8092539,0,12566463,666680,16777215,49407,3684410,0,0,0,16777215,16777215,30882,1137094,5855577,0,11573124,15652797,10929378,6275299,6275299,6275299,6275299,6275299,6275299,6275299,6275299,6275299,6275299,10092543,10092543,12566463,14277081,5395026,42752,12566463,26367,36799,15921906,11352,16777215,16777215,13158,5395026,16777215,13224393,13294830,801923,3243501,16777215,1137094,16777215,5395026,16777215,3289655,0,0,0,4296113,11838,16777215,16777215,0,801923,11141282,16777215,16764057,16764057,16764057,16764057,13005646,204,11838,15921906,36799,3368601,11389944,801923,6275299,16777215,3610052,4210752,14083324,7434613,16777215,12566463,16777215,36799,5395026,16777215,0,855309,10086143,1137094,1137094,1137094,16777215,3506772,19816,2315831,2315831,6275299,16777215,0,16777215,16777215,3506772,16777215]
[16777215,36799,0,192,19816,19816,49407,8562637,1137094,8092539,0,8092539,666680,0,49407,3684410,0,16777215,0,16777215,0,30882,1137094,5855577,16777215,11573124,15652797,10929378,6275299,6275299,6275299,6275299,6275299,6275299,6275299,6275299,6275299,6275299,10092543,10092543,12566463,14277081,5395026,16777215,12566463,26367,36799,15921906,16777215,0,16777215,13158,5395026,16777215,14408667,13294830,801923,3243501,16777215,16777215,16777215,16777215,16777215,15773696,16777215,0,0,4296113,11838,16777215,16777215,0,801923,16777215,16777215,16764057,16764057,16764057,16764057,13005646,204,11838,16777215,36799,3368601,1137094,801923,6275299,16777215,3610052,7434613,8092539,7434613,16777215,12566463,16777215,36799,16777215,16777215,16777215,855309,10086143,1137094,801923,801923,16777215,3506772,19816,7434613,3368601,6275299,3506772,3506772,3506772,0,3506772,3506772]
[16777215,36799,11352,192,9359529,9359529,49407,14083051,4891128,8092539,0,8092539,666680,16777215,49407,0,0,16777215,16777215,16777215,16777215,30882,1137094,13553360,16777215,11573124,15652797,10929378,6275299,6275299,6275299,6275299,6275299,6275299,6275299,6275299,6275299,6275299,10092543,10092543,12566463,14277081,5395026,16777215,12566463,204,36799,15921906,16777215,16777215,16777215,13158,5395026,16777215,9851952,13294830,801923,3243501,16777215,16777215,16777215,16777215,16777215,3289655,16777215,11352,10921638,4296113,16777215,16777215,16777215,14412,801923,16777215,16777215,16777215,16777215,16777215,16777215,16777215,204,16777215,16777215,36799,3368601,11389944,801923,6275299,16777215,3610052,7434613,8092539,7434613,16777215,12566463,16777215,36799,16777215,16777215,16777215,855309,10086143,1137094,801923,801923,3506772,3506772,9359529,7434613,3368601,6275299,2315831,3506772,3506772,16777215,3506772,3506772]
[3688550,36799,11352,192,9359529,9359529,49407,1709849,801923,8092539,0,12566463,666680,16764159,49407,0,0,3243501,3243501,15123099,16777215,30882,1137094,13553360,0,11573124,15652797,10929378,6275299,6275299,6275299,6275299,6275299,6275299,6275299,6275299,6275299,6275299,10092543,10092543,0,14277081,5395026,16777215,12566463,204,36799,0,16777215,16777215,36799,13158,5395026,16777215,9851952,13294830,801923,3243501,36799,1137094,13408767,16777215,3289655,3289655,0,11352,10921638,4296113,16777215,16777215,36799,14412,801923,16777215,16777215,16777215,16777215,16777215,16777215,16777215,204,16777215,15921906,36799,3368601,1137094,801923,6275299,4210752,3610052,7434613,8092539,7434613,36799,0,36799,16777215,16777215,16777215,0,855309,10086143,1137094,0,801923,3506772,0,9359529,7434613,3368601,6275299,3506772,0,36799,16764159,192,3506772]
[10053375,36799,11352,192,9359529,9359529,49407,14083051,1137094,8092539,0,8092539,1799573,16764159,49407,0,16777215,15921906,15921906,11892015,16777215,30882,1137094,13553360,16777215,16777215,15652797,10929378,6275299,6275299,6275299,6275299,6275299,6275299,6275299,6275299,6275299,6275299,10092543,10092543,0,14277081,16777215,42752,12566463,204,36799,16777215,11352,16777215,36799,13158,5395026,15921906,9851952,13294830,801923,3243501,36799,1137094,13408767,5395026,3289655,3289655,13311,11352,10921638,4296113,16777215,15921906,36799,14412,801923,11141282,8696052,16777215,16777215,16777215,16777215,16777215,16777215,16777215,16777215,36799,13158,11389944,801923,6275299,4210752,3610052,4210752,16777215,5193523,36799,0,36799,16777215,5395026,16777215,13224393,855309,10086143,1137094,801923,801923,2315831,0,9359529,5193523,13158,6275299,36799,13224393,36799,16764159,192,3289655]
[10053375,36799,11352,192,19816,19816,24704,1709849,2500134,8092539,0,8092539,1799573,16777215,3191504,0,0,15921906,15921906,10552763,16777215,30882,1137094,13553360,16777215,11573124,15652797,10929378,16728,1281739,16728,15773696,12611584,10498160,10925084,9465920,4525507,1424208,13382400,16764057,16777215,12566463,16777215,42752,12566463,204,16777215,0,11352,16777215,36799,13158,5395026,16777215,9851952,13294830,801923,3243501,36799,1137094,13408767,5395026,3289655,3289655,11447982,11352,3684410,4296113,16777215,15921906,36799,14412,801923,11141282,8696052,16764057,16764057,16764057,16764057,13005646,16777215,16777215,16777215,16777215,13158,1137094,801923,1799573,4210752,3610052,7434613,16777215,5193523,36799,16777215,36799,16777215,5395026,4210752,13224393,855309,1137094,1137094,801923,801923,3506772,0,19816,5193523,13158,1424208,36799,13224393,3506772,16777215,192,3289655]
[6684876,36799,11352,192,19816,19816,49407,14083051,2500134,8092539,0,14277081,2199221,16777215,49407,0,0,15921906,15921906,10689949,16777215,30882,1137094,13553360,16777215,11573124,0,10929378,16728,1281739,16728,15773696,12611584,10498160,10925084,9465920,4525507,1424208,13382400,16764057,0,12566463,16777215,42752,5855577,204,36799,0,11352,16777215,36799,0,5395026,3684410,14408667,13294830,801923,3243501,36799,1137094,13408767,5395026,3289655,3289655,11447982,11352,3684410,4296113,16777215,15921906,36799,14412,801923,11141282,8696052,16764057,16764057,16764057,16764057,13005646,16777215,16777215,16777215,36799,13158,11389944,801923,1799573,4210752,3610052,7434613,16777215,5193523,36799,0,36799,36799,5395026,5296274,13224393,855309,1137094,1137094,1137094,1137094,36799,0,19816,5193523,13158,1424208,3506772,13224393,3506772,16777215,192,3506772]
[10053375,36799,11352,192,192,192,49407,1709849,2500134,8092539,0,8092539,2199221,11184814,49407,0,10225233,15921906,15921906,9145333,11184814,30882,6740479,0,16777215,10921638,10498160,13158,16728,1281739,16728,15773696,12611584,10498160,10925084,9465920,4525507,1424208,13382400,16764057,12566463,11854022,5395026,42752,5855577,204,36799,0,11352,16777215,36799,16777215,5395026,3684410,13224393,13294830,801923,3243501,36799,1137094,13408767,5395026,3289655,3289655,11447982,11352,3684410,16777215,11838,15921906,36799,14412,801923,11141282,8696052,16764057,16764057,16764057,16764057,13005646,16777215,11838,16777215,36799,13158,1137094,801923,1799573,4210752,3610052,4210752,8092539,5193523,192,12566463,36799,36799,5395026,6740479,16777215,855309,1137094,1137094,1137094,1137094,36799,0,192,5193523,13158,1424208,3506772,16777215,3506772,11184814,192,3506772]
[10053375,36799,11352,192,192,192,49407,1709849,2500134,8092539,0,8092539,2199221,11184814,49407,0,10225233,801923,0,5263615,11184814,30882,6740479,13553360,16777215,10921638,10498160,13158,16728,1281739,16728,15773696,12611584,10498160,10925084,9465920,4525507,1424208,13382400,16764057,16777215,14277081,5395026,42752,5855577,6740479,36799,15921906,16777215,16777215,36799,16777215,5395026,3684410,13224393,13158,801923,3243501,36799,0,13408767,5395026,3289655,3289655,12566463,11352,3684410,16777215,11838,15921906,36799,14412,801923,11141282,8696052,16764057,5935018,16764057,16764057,3561320,16777215,11838,16777215,36799,13158,11389944,801923,1799573,4210752,3610052,7434613,8092539,5193523,36799,14277081,36799,36799,5395026,6740479,16777215,855309,1137094,0,1137094,1137094,36799,0,192,5193523,13158,1424208,3506772,9359529,3506772,11184814,192,3506772]
[1842988,36799,11352,192,16777215,16777215,49407,14083051,2500134,8092539,0,4210752,2199221,16777215,1137094,0,10225233,15921906,15921906,293628,16777215,30882,1137094,0,16777215,10921638,10498160,16777215,16728,1281739,16728,15773696,12611584,10498160,10925084,9465920,4525507,1424208,13382400,16764057,16777215,3506772,5395026,42752,12566463,6740479,36799,15921906,16777215,16777215,36799,16777215,5395026,16777215,16777215,6966,801923,3243501,36799,1137094,13408767,5395026,3289655,0,12566463,11352,10921638,16777215,11838,15921906,36799,14412,801923,11141282,3684410,16764057,5935018,16764057,16764057,3561320,204,11838,16777215,36799,3368601,1137094,801923,1799573,4210752,16777215,7434613,8092539,7434613,36799,14277081,12611584,36799,5395026,6740479,16777215,855309,1137094,255,1137094,1137094,36799,0,16777215,7434613,3368601,1424208,3506772,3506772,36799,16777215,192,3289655]
[3688550,36799,11352,192,16777215,16777215,49407,1709849,2500134,8092539,0,8092539,16777215,16764159,49407,0,10225233,801923,0,49407,16777215,30882,6740479,13553360,16777215,10921638,0,7998,16728,1281739,16728,15773696,12611584,10498160,10925084,9465920,4525507,1424208,13382400,16764057,14277081,14277081,0,42752,16711680,6740479,36799,0,11352,16777215,36799,16777215,5395026,16711680,16777215,6966,801923,3243501,36799,0,13408767,5395026,3289655,0,11447982,11352,10921638,16777215,11838,15921906,36799,14412,801923,11141282,3684410,10017782,10017782,10017782,10017782,0,204,11838,16777215,36799,3368601,16777215,801923,1799573,4210752,16777215,7434613,8092539,7434613,36799,14277081,36799,36799,5395026,855309,16777215,16777215,1137094,255,0,0,36799,0,16777215,7434613,3368601,1424208,36799,3506772,36799,16764159,192,3289655]
[3688550,36799,11352,0,192,192,49407,1709849,16777215,8092539,3243501,4210752,16777215,14412,1137094,0,10225233,801923,0,65535,14412,16777215,6740479,13553360,16777215,10921638,0,7998,16777215,16777215,16777215,16777215,16777215,16777215,16777215,16777215,16777215,16777215,16777215,16777215,0,11854022,3684410,4016795,16711680,6740479,36799,0,11352,14412,36799,16777215,0,16711680,16777215,13294830,801923,192,36799,0,13408767,5395026,3289655,3289655,12566463,11352,16777215,16777215,11838,15921906,36799,14412,1137094,977128,3684410,10017782,10017782,10017782,10017782,0,204,11838,16777215,36799,3368601,16777215,0,16777215,4210752,3610052,4210752,8092539,7434613,36799,0,36799,3684410,5395026,4210752,13224393,16777215,16777215,65535,255,255,36799,3243501,3506772,7434613,3368601,3506772,36799,13224393,36799,14412,0,3289655]
[3688550,36799,16777215,0,9359529,9359529,49407,14083051,16777215,8092539,3243501,8092539,16777215,16777215,49407,16777215,10225233,3243501,3243501,5296274,16777215,19816,6740479,16777215,16764159,10921638,0,16777215,16777215,16777215,16777215,16777215,16777215,16777215,16777215,16777215,16777215,16777215,16777215,16777215,8421504,8421504,16777215,4016795,16711680,6740479,36799,16777215,16777215,16777215,36799,16777215,0,16711680,16777215,13294830,10086143,192,36799,0,13408767,5395026,3289655,3289655,11447982,16777215,16777215,16777215,11838,15921906,36799,16777215,1137094,977128,3684410,16777215,16777215,16777215,10017782,16777215,0,11838,16777215,36799,13158,16777215,0,16777215,4210752,3610052,7434613,6740479,5193523,36799,8421504,36799,3684410,5395026,855309,5855577,16777215,16777215,65535,255,255,36799,3243501,3506772,5193523,13158,3506772,36799,5855577,36799,16777215,0,3289655]
[16777215,16777215,16777215,0,9359529,9359529,49407,14083051,16777215,8092539,3243501,8092539,16777215,16777215,1137094,16777215,10225233,801923,0,16777215,16777215,19816,1137094,16777215,16777215,10921638,0,16777215,16777215,16777215,16777215,16777215,16777215,16777215,16777215,16777215,16777215,16777215,16777215,16777215,0,8421504,16777215,42752,16711680,6740479,36799,16777215,16777215,16777215,16777215,13158,0,16711680,16777215,16777215,10086143,192,16777215,0,16777215,16777215,16777215,3289655,11447982,16777215,16777215,16777215,11838,16777215,16777215,16777215,1137094,11141282,3684410,16777215,16777215,16777215,10017782,16777215,204,11838,16382457,36799,13158,16777215,0,16777215,16777215,16777215,4210752,6740479,5193523,16777215,0,16777215,3684410,16777215,16777215,16777215,16777215,16777215,0,65535,65535,16777215,3243501,3506772,5193523,13158,3506772,16777215,16777215,16777215,16777215,0,16777215]
[16777215,16777215,16777215,16777215,9359529,16772300,16777215,16777215,855309,16777215,16777215,16777215,1799573,16777215,16777215,16777215,16777215,16777215,16777215,16777215,16777215,16777215,16777215,16777215,16777215,16777215,0,10929378,16728,1281739,16728,15773696,12611584,10498160,10925084,9465920,4525507,1424208,13382400,16764057,16777215,16777215,16777215,16777215,16777215,16777215,36799,0,11352,16777215,16777215,16777215,16777215,0,11389944,16777215,16777215,16777215,16777215,16777215,16777215,16777215,16777215,16777215,16777215,11352,16777215,16777215,16777215,16777215,16777215,16777215,16777215,16777215,16777215,16777215,16777215,11854022,16777215,16777215,204,16777215,16777215,36799,3368601,16777215,16777215,2593979,16777215,16777215,16777215,16777215,7434613,16777215,16777215,16777215,36799,16777215,16777215,16777215,16777215,801923,0,0,13434828,16777215,16777215,16772300,7434613,3368601,1424208,16777215,16777215,16777215,3506772,16777215,16777215]
[3293276,36799,0,16777215,5878757,16772300,16777215,16777215,855309,16777215,16777215,16777215,1799573,16777215,16777215,3684410,16777215,16777215,16777215,16777215,16777215,16777215,16777215,5855577,16777215,16777215,10855845,10929378,16728,1281739,16728,15773696,12611584,10498160,10925084,9465920,4525507,1424208,13382400,16764057,0,16777215,3684410,16777215,16777215,204,36799,0,11352,0,16777215,16777215,16777215,0,11389944,6966,16777215,16777215,16777215,16777215,16777215,16777215,16777215,16777215,16777215,11352,0,16777215,16777215,16777215,16777215,0,16777215,16777215,16777215,16769217,16769217,11854022,16769217,10954261,204,16777215,16777215,36799,3368601,16777215,16777215,2593979,16777215,16777215,16777215,8092539,7434613,16777215,0,16777215,36799,16777215,16777215,16777215,16777215,801923,8696052,8696052,13434828,16777215,16777215,16772300,7434613,3368601,1424208,16777215,16777215,16777215,3506772,16777215,16777215]
[3293276,36799,0,16777215,5878757,16772300,49407,16777215,855309,8092539,16777215,8092539,1799573,6740479,49407,3684410,16777215,3243501,3243501,255,6740479,16777215,11389944,5855577,0,16777215,15652797,13158,16728,1281739,16728,15773696,12611584,10498160,10925084,9465920,4525507,1424208,13382400,16764057,11389944,0,3684410,16777215,16777215,26367,36799,15921906,11352,801923,36799,16777215,16777215,0,11389944,13158,16777215,16777215,36799,1137094,13408767,16777215,3289655,15189684,16777215,11352,0,16777215,16777215,16777215,36799,0,16777215,16777215,8696052,16769217,16769217,11854022,16769217,10954261,204,16777215,13553360,36799,3368601,16777215,16777215,2593979,16777215,3610052,16777215,8092539,7434613,36799,49407,36799,36799,16777215,16777215,0,16777215,801923,1137094,0,13434828,36799,16777215,16772300,3506772,3506772,1424208,36799,0,36799,3506772,16777215,3289655]
[3293276,36799,0,16777215,19816,16772300,36799,16777215,4891128,8092539,16777215,8092539,1799573,1137094,49407,3684410,0,15921906,15921906,293628,6740479,16777215,11389944,5855577,0,11573124,15652797,13158,6275299,6275299,6275299,6275299,6275299,6275299,6275299,6275299,6275299,6275299,10092543,10092543,11389944,14277081,3684410,16777215,16777215,26367,36799,0,16777215,801923,36799,16777215,16777215,0,11389944,16777215,16777215,16777215,36799,1137094,13408767,8092539,3289655,15189684,4539865,11352,0,16777215,16777215,16777215,36799,0,16777215,16777215,801923,16764057,16764057,11854022,16764057,14064512,204,16777215,13553360,36799,3368601,16777215,16777215,6275299,16777215,3610052,16777215,14083324,7434613,36799,49407,36799,1137094,5395026,16777215,0,16777215,10086143,1137094,1137094,1137094,36799,16777215,16772300,3506772,2315831,6275299,36799,0,36799,3506772,16777215,3289655]
[3293276,36799,0,16777215,19816,16772300,36799,16777215,1137094,8092539,16777215,8092539,1799573,6740479,49407,3684410,0,15921906,15921906,16777215,6740479,16777215,1137094,5855577,0,11573124,10855845,13158,6275299,6275299,6275299,6275299,6275299,6275299,6275299,6275299,6275299,6275299,10092543,10092543,14277081,14277081,5395026,16777215,16777215,26367,36799,15921906,16777215,16777215,16777215,16777215,16777215,0,13224393,13158,801923,16777215,16777215,1137094,16777215,8092539,3289655,3289655,0,11352,0,16777215,16777215,16777215,16777215,0,16777215,16777215,16777215,16764057,5935018,11854022,16764057,3561320,204,16777215,13553360,36799,3368601,16777215,16777215,6275299,16777215,3610052,16777215,14083324,7434613,16777215,14277081,16777215,1137094,5395026,16777215,0,16777215,10086143,1137094,1137094,1137094,16777215,16777215,16772300,3506772,3506772,6275299,16777215,0,16777215,6740479,16777215,3289655]
[16777215,36799,0,16777215,19816,16764057,49407,5263191,4891128,8092539,16777215,8092539,666680,16777215,49407,3684410,4210752,0,16777215,16777215,16777215,16777215,1137094,5855577,16777215,4210752,15652797,10929378,6275299,6275299,6275299,6275299,6275299,6275299,6275299,6275299,6275299,6275299,10092543,10092543,14277081,14277081,5395026,16777215,16777215,26367,36799,15921906,16777215,16777215,16777215,13158,16777215,0,13224393,13294830,801923,16777215,16777215,16777215,16777215,8092539,16777215,3289655,0,11352,0,4296113,11838,16777215,16777215,0,16777215,16777215,16777215,16777215,16764057,9359529,16777215,14064512,204,11838,16777215,36799,3368601,16777215,16777215,6275299,16777215,3610052,16777215,14083324,7434613,16777215,14277081,16777215,16777215,5395026,16777215,16777215,16777215,10086143,1137094,1137094,1137094,16777215,3506772,16764057,3506772,3506772,6275299,16777215,16777215,16777215,16777215,3506772,16777215]
[16777215,36799,0,16777215,19816,19816,49407,5263191,801923,8092539,16777215,16777215,666680,0,49407,3684410,4210752,16777215,16777215,16777215,0,30882,1137094,5855577,16777215,4210752,15652797,10929378,6275299,6275299,6275299,6275299,6275299,6275299,6275299,6275299,6275299,6275299,10092543,10092543,12566463,14277081,5395026,16777215,12566463,26367,36799,0,16777215,0,16777215,13158,16777215,16777215,13224393,13294830,801923,16777215,16777215,16777215,16777215,16777215,16777215,15773696,16777215,11352,10921638,4296113,11838,16777215,16777215,0,16777215,16777215,16777215,16764057,5935018,16764057,16764057,3561320,204,11838,16777215,36799,3368601,16777215,16777215,6275299,16777215,3610052,4210752,8092539,7434613,16777215,12566463,16777215,16777215,16777215,16777215,16777215,16777215,10086143,1137094,801923,801923,16777215,3506772,19816,2315831,3506772,6275299,16777215,16777215,16777215,0,3506772,16777215]
[16777215,16777215,5934,192,9359529,9359529,16777215,5263191,1137094,16777215,0,16777215,666680,666680,49407,666680,4210752,16777215,16777215,16777215,666680,30882,1137094,7434613,16777215,4210752,15652797,10929378,6275299,6275299,6275299,6275299,6275299,6275299,6275299,6275299,6275299,6275299,10092543,10092543,0,14277081,5395026,16777215,12566463,26367,36799,15921906,16777215,666680,16777215,13158,5395026,16777215,13224393,13294830,801923,3243501,16777215,16777215,16777215,16777215,16777215,3289655,16777215,11352,10921638,4296113,16777215,16777215,16777215,666680,801923,16777215,16777215,16764057,16777215,16777215,16764057,16777215,204,16777215,16777215,36799,3368601,11389944,801923,6275299,16777215,3610052,7434613,8092539,7434613,16777215,0,16777215,16777215,16777215,16777215,16777215,855309,10086143,1137094,0,0,16777215,3506772,9359529,3506772,3506772,6275299,3506772,3506772,3506772,666680,3506772,3506772]
[16777215,36799,5934,192,9359529,9359529,16777215,16777215,4891128,8092539,0,8092539,666680,16777215,49407,666680,0,16777215,16777215,16777215,16777215,30882,1137094,7434613,16777215,11573124,15652797,10929378,6275299,6275299,6275299,6275299,6275299,6275299,6275299,6275299,6275299,6275299,10092543,10092543,0,12566463,5395026,16777215,12566463,204,36799,0,16777215,16777215,16777215,13158,5395026,16777215,14408667,13294830,801923,3243501,16777215,16777215,16777215,16777215,16777215,3289655,16777215,11352,10921638,4296113,16777215,16777215,16777215,666680,801923,16777215,16777215,16777215,16777215,16777215,16777215,16777215,204,16777215,16777215,36799,3368601,1137094,801923,6275299,16777215,3610052,7434613,16777215,7434613,16777215,0,16777215,16777215,16777215,16777215,16777215,855309,10086143,1137094,0,0,3506772,0,9359529,7434613,3368601,6275299,3506772,9359529,3506772,16777215,192,3506772]
[16777215,36799,11352,192,9359529,9359529,49407,16777215,801923,8092539,0,8092539,666680,16777215,3191504,0,0,16777215,16777215,16777215,16777215,30882,1137094,13553360,16777215,11573124,15652797,10929378,16728,1281739,16728,15773696,12611584,10498160,10925084,9465920,4525507,1424208,13382400,16764057,16777215,12566463,16777215,16777215,12566463,204,36799,16777215,11352,16777215,16777215,0,5395026,16777215,9851952,13294830,801923,3243501,16777215,16777215,16777215,16777215,16777215,16777215,16777215,11352,10921638,4296113,16777215,16777215,16777215,14412,801923,16777215,16777215,16777215,16777215,16777215,16777215,16777215,16777215,16777215,16777215,36799,3368601,11389944,801923,6275299,16777215,3610052,7434613,16777215,7434613,16777215,16777215,16777215,16777215,16777215,16777215,16777215,855309,10086143,801923,16777215,0,3506772,0,9359529,7434613,3368601,1424208,3506772,3506772,3506772,16777215,192,3506772]
[3688550,36799,11352,192,9359529,9359529,24704,1709849,855309,8092539,0,8092539,1799573,16777215,3191504,0,16777215,3243501,3243501,11892015,16777215,30882,1137094,13553360,0,16777215,15652797,10929378,16728,1281739,16728,15773696,12611584,10498160,10925084,9465920,4525507,1424208,13382400,16764057,16777215,12566463,16777215,42752,12566463,204,36799,16777215,11352,192,36799,0,5395026,15921906,14408667,13294830,801923,3243501,36799,1137094,13408767,16777215,3289655,3289655,0,11352,3684410,4296113,16777215,16777215,36799,14412,801923,11141282,8696052,16777215,16777215,16777215,16777215,16777215,16777215,16777215,15921906,36799,13158,1137094,801923,2593979,4210752,3610052,4210752,16777215,5193523,36799,16777215,36799,16777215,16777215,16777215,0,855309,801923,1137094,0,0,3506772,0,9359529,5193523,13158,1424208,3506772,0,3506772,16777215,192,3506772]
[10053375,36799,11352,192,19816,19816,49407,14083051,855309,8092539,0,8092539,1799573,16777215,49407,0,0,15921906,15921906,10552763,16777215,30882,1137094,13553360,16777215,11573124,15652797,10929378,16728,1281739,16728,15773696,12611584,10498160,10925084,9465920,4525507,1424208,13382400,16764057,16777215,0,16777215,42752,12566463,204,16777215,16777215,16777215,16777215,36799,0,5395026,16777215,14408667,13294830,801923,3243501,36799,1137094,13408767,5395026,3289655,3289655,11447982,11352,3684410,4296113,16777215,15921906,0,14412,801923,11141282,8696052,16764057,16764057,16764057,16764057,14064512,16777215,16777215,16777215,16777215,13158,11389944,801923,2593979,4210752,3610052,7434613,16777215,5193523,36799,16777215,36799,16777215,5395026,4210752,13224393,855309,801923,1137094,801923,801923,3506772,0,19816,5193523,13158,1424208,3506772,13224393,3506772,16777215,192,3506772]
[3688550,36799,11352,192,19816,19816,49407,14083051,2500134,8092539,0,12566463,2199221,16777215,49407,0,0,15921906,15921906,10689949,16777215,30882,6740479,7434613,16777215,11573124,0,10929378,0,0,0,0,0,0,0,0,0,0,0,0,16777215,0,16777215,42752,5855577,204,36799,0,11352,16777215,36799,13158,5395026,3684410,14408667,13294830,801923,3243501,36799,1137094,13408767,5395026,3289655,3289655,11447982,11352,3684410,4296113,16777215,15921906,36799,14412,801923,11141282,8696052,16764057,5935018,16764057,16764057,3561320,16777215,16777215,16777215,36799,13158,1137094,801923,1799573,4210752,3610052,7434613,16777215,5193523,36799,16777215,36799,16777215,5395026,5296274,13224393,855309,1137094,1137094,1137094,1137094,36799,0,19816,5193523,13158,0,3506772,3506772,3506772,16777215,192,3506772]
[10053375,36799,5934,192,19816,19816,49407,1709849,2500134,8092539,0,12566463,0,16777215,49407,666680,0,15921906,15921906,9145333,16777215,30882,6740479,7434613,16777215,11573124,10498160,13158,16728,1281739,16728,15773696,12611584,10498160,10925084,9465920,4525507,1424208,13382400,16764057,0,14277081,16777215,42752,5855577,204,36799,24704,11352,16777215,36799,16777215,5395026,3684410,13224393,13294830,801923,3243501,36799,1137094,13408767,5395026,3289655,3289655,12566463,11352,3684410,16777215,16777215,15921906,36799,666680,801923,11141282,8696052,16764057,5935018,16764057,16764057,3561320,16777215,16777215,16777215,36799,13158,11389944,801923,1799573,4210752,3610052,4210752,16777215,5193523,36799,0,36799,36799,5395026,5296274,13224393,855309,1137094,1137094,1137094,1137094,36799,0,19816,5193523,13158,1424208,2315831,3506772,3506772,16777215,192,3506772]
[1842988,36799,5934,192,19816,19816,49407,14083051,2500134,8092539,0,14277081,0,16777215,1137094,666680,0,801923,0,5263615,16777215,30882,1137094,7434613,16764159,11573124,10498160,13158,16728,1281739,16728,15773696,12611584,10498160,10925084,9465920,4525507,1424208,13382400,16764057,12566463,14277081,5395026,42752,5855577,6740479,36799,0,11352,16777215,36799,16777215,5395026,3684410,13224393,13158,801923,3243501,36799,0,13408767,5395026,3289655,3289655,12566463,11352,3684410,16777215,11838,15921906,36799,666680,801923,11141282,8696052,16764057,16764057,16764057,16764057,14064512,16777215,11838,16777215,36799,13158,1137094,801923,1799573,4210752,16777215,7434613,8092539,5193523,192,12566463,36799,36799,5395026,6740479,13224393,855309,1137094,1137094,1137094,1137094,36799,0,19816,5193523,13158,1424208,3506772,9359529,36799,16777215,192,3289655]
[1842988,36799,5934,192,16777215,16777215,49407,14083051,2500134,8092539,0,8092539,2199221,16777215,49407,666680,10225233,15921906,15921906,293628,16777215,30882,1137094,7434613,16777215,10921638,10498160,16777215,16728,1281739,16728,15773696,12611584,10498160,10925084,9465920,4525507,1424208,13382400,16764057,16777215,14277081,5395026,5789690,12566463,204,36799,0,16777215,192,36799,16777215,5395026,16777215,16777215,6966,801923,3243501,36799,1137094,13408767,5395026,3289655,3289655,11447982,11352,3684410,16777215,11838,15921906,36799,666680,801923,5789690,8696052,16764057,16764057,16764057,16764057,14064512,16777215,11838,16777215,36799,3368601,16777215,801923,1799573,4210752,16777215,7434613,8092539,7434613,192,14277081,12611584,36799,5395026,6740479,16777215,16777215,1137094,0,1137094,1137094,36799,0,16777215,7434613,3368601,1424208,192,3506772,36799,16777215,192,3289655]
[3688550,36799,5934,192,16777215,16777215,49407,1709849,16777215,8092539,0,8092539,16777215,16777215,49407,666680,10225233,3243501,3243501,49407,16777215,16777215,6740479,7434613,16777215,10921638,10498160,16777215,16728,1281739,16728,15773696,12611584,10498160,10925084,9465920,4525507,1424208,13382400,16764057,14277081,14277081,3684410,5789690,16711680,6740479,36799,0,16777215,16777215,36799,16777215,5395026,16711680,16777215,6966,801923,3243501,36799,0,13408767,8092539,3289655,3289655,11447982,11352,10921638,16777215,11838,15921906,36799,666680,801923,5789690,8696052,10017782,10017782,10017782,5935018,0,16777215,11838,16382457,36799,3368601,16777215,801923,16777215,4210752,16777215,7434613,8092539,7434613,36799,14277081,36799,36799,5395026,5287936,16777215,16777215,16777215,255,1137094,1137094,36799,0,3506772,7434613,3368601,1424208,36799,3506772,36799,16777215,192,3289655]
[3688550,36799,11352,16777215,192,192,49407,1709849,16777215,8092539,16777215,4210752,16777215,14412,1137094,0,10225233,3243501,3243501,65535,14412,16777215,1137094,13553360,16764159,10921638,0,16777215,16777215,16777215,16777215,16777215,16777215,16777215,16777215,16777215,16777215,16777215,16777215,16777215,0,11854022,16777215,5789690,16711680,204,36799,16777215,11352,14412,36799,16777215,16777215,16711680,16777215,6966,801923,16777215,36799,0,13408767,8092539,3289655,3289655,12566463,11352,16777215,16777215,11838,15921906,36799,14412,16777215,5789690,3684410,10017782,10017782,10017782,5935018,0,204,11838,16777215,36799,3368601,16777215,16777215,16777215,4210752,16777215,4210752,6740479,7434613,36799,0,36799,36799,5395026,4210752,13224393,16777215,16777215,255,0,0,36799,16777215,3506772,7434613,3368601,3506772,36799,13224393,36799,14412,16777215,3289655]
[3688550,36799,16777215,0,9359529,9359529,49407,14083051,16777215,8092539,3243501,8092539,16777215,16777215,49407,16777215,10225233,15921906,15921906,5296274,16777215,19816,6740479,16777215,16777215,10921638,15652797,16777215,16777215,16777215,16777215,16777215,16777215,16777215,16777215,16777215,16777215,16777215,16777215,16777215,0,8421504,16777215,42752,16711680,6740479,36799,16777215,11352,16777215,36799,16777215,0,16711680,16777215,13294830,10086143,192,36799,1137094,13408767,8092539,3289655,3289655,11447982,11352,16777215,16777215,11838,15921906,36799,16777215,1137094,11141282,3684410,16777215,16777215,16777215,5935018,16777215,204,11838,16777215,36799,3368601,16777215,0,16777215,4210752,16777215,7434613,6740479,7434613,36799,0,36799,36799,5395026,855309,16777215,16777215,16777215,65535,255,255,36799,3243501,3506772,7434613,3368601,3506772,36799,16777215,36799,16777215,0,3289655]
[16777215,16777215,16777215,0,9359529,9359529,49407,1709849,16777215,8092539,3243501,8092539,16777215,16777215,49407,16777215,10225233,801923,0,16777215,16777215,19816,1137094,16777215,16777215,10921638,15652797,16777215,16777215,16777215,16777215,16777215,16777215,16777215,16777215,16777215,16777215,16777215,16777215,16777215,14277081,8421504,16777215,42752,16711680,6740479,36799,16777215,16777215,16777215,16777215,16777215,0,16711680,16777215,16777215,10086143,192,16777215,0,16777215,16777215,16777215,3289655,11447982,16777215,16777215,16777215,11838,16777215,16777215,16777215,1137094,11141282,3684410,16777215,16777215,16777215,5935018,16777215,16777215,11838,16777215,36799,13158,16777215,0,16777215,16777215,16777215,4210752,6740479,5193523,16777215,14277081,16777215,3684410,16777215,16777215,16777215,16777215,16777215,0,255,255,16777215,3243501,3506772,5193523,13158,3506772,16777215,16777215,16777215,16777215,0,16777215]
[16777215,16777215,16777215,16777215,9359529,9359529,16777215,16777215,855309,16777215,16777215,16777215,1799573,16777215,16777215,16777215,16777215,16777215,16777215,16777215,16777215,16777215,16777215,16777215,16777215,16777215,0,10929378,16728,1281739,16728,15773696,12611584,10498160,10925084,9465920,4525507,1424208,13382400,16764057,16777215,16777215,16777215,16777215,16777215,16777215,36799,0,11352,0,16777215,16777215,16777215,0,11389944,16777215,16777215,16777215,16777215,16777215,16777215,16777215,16777215,16777215,16777215,11352,16777215,16777215,16777215,16777215,16777215,16777215,16777215,16777215,16777215,16777215,16777215,16777215,16777215,16777215,204,16777215,16777215,36799,3368601,16777215,16777215,2593979,16777215,16777215,16777215,16777215,7434613,16777215,16777215,16777215,16777215,16777215,16777215,16777215,16777215,801923,0,0,13434828,16777215,16777215,9359529,7434613,3368601,1424208,16777215,16777215,16777215,3506772,16777215,16777215]
[16777215,16777215,0,16777215,9359529,16772300,16777215,16777215,855309,16777215,16777215,16777215,1799573,16777215,16777215,3684410,16777215,16777215,16777215,16777215,16777215,16777215,16777215,5855577,16777215,16777215,15652797,10929378,16728,1281739,16728,15773696,12611584,10498160,10925084,9465920,4525507,1424208,13382400,16764057,0,16777215,3684410,16777215,16777215,16777215,36799,0,11352,801923,16777215,16777215,16777215,0,11389944,16777215,16777215,16777215,16777215,16777215,16777215,16777215,16777215,16777215,16777215,11352,0,16777215,16777215,16777215,16777215,0,16777215,16777215,16777215,16777215,16777215,11854022,16777215,16777215,204,16777215,16777215,36799,3368601,16777215,16777215,2593979,16777215,3610052,16777215,16777215,7434613,16777215,0,16777215,36799,16777215,16777215,16777215,16777215,801923,8696052,1137094,13434828,16777215,16777215,16772300,7434613,3368601,1424208,16777215,16777215,16777215,3506772,16777215,16777215]
[16777215,36799,0,16777215,19816,16772300,16777215,16777215,855309,16777215,16777215,16777215,1799573,1137094,16777215,3684410,16777215,16777215,16777215,16777215,6740479,16777215,16777215,5855577,16777215,16777215,15652797,13158,16728,1281739,16728,15773696,12611584,10498160,10925084,9465920,4525507,1424208,13382400,16764057,11389944,0,3684410,16777215,16777215,26367,36799,15921906,11352,16777215,16777215,16777215,16777215,0,10921638,16777215,16777215,16777215,16777215,16777215,16777215,16777215,16777215,15189684,16777215,11352,0,16777215,16777215,16777215,16777215,0,16777215,16777215,16777215,16777215,16777215,11854022,16777215,16777215,204,16777215,16777215,36799,3368601,16777215,16777215,2593979,16777215,16777215,16777215,16777215,7434613,16777215,49407,16777215,16777215,16777215,16777215,16777215,16777215,801923,1137094,1137094,13434828,16777215,16777215,16772300,3506772,3506772,1424208,16777215,16777215,16777215,3506772,16777215,16777215]
[3293276,36799,0,16777215,19816,16772300,49407,16777215,855309,8092539,16777215,16777215,1799573,6740479,16777215,3684410,0,16777215,16777215,16777215,6740479,16777215,1137094,5855577,16777215,11573124,15652797,13158,16728,1281739,16728,15773696,12611584,10498160,10925084,9465920,4525507,1424208,13382400,16764057,0,49407,3684410,16777215,16777215,26367,36799,15921906,16777215,16777215,16777215,16777215,16777215,0,11389944,16777215,16777215,16777215,16777215,16777215,16777215,16777215,16777215,15189684,4539865,11352,0,16777215,16777215,16777215,16777215,0,16777215,16777215,16777215,16777215,16777215,11854022,16777215,16777215,204,16777215,16777215,36799,3368601,16777215,16777215,2593979,16777215,3610052,16777215,8092539,7434613,16777215,0,16777215,16777215,16777215,16777215,16777215,16777215,801923,1137094,1137094,13434828,16777215,16777215,16772300,3506772,2315831,3506772,16777215,16777215,16777215,3506772,16777215,16777215]
[3293276,36799,0,16777215,19816,16772300,49407,1709849,1137094,8092539,16777215,16777215,1799573,6740479,16777215,3684410,0,16777215,16777215,16777215,6740479,16777215,1137094,5855577,16777215,11573124,15652797,13158,16728,1281739,16728,15773696,12611584,10498160,10925084,9465920,4525507,1424208,13382400,16764057,11389944,14277081,3684410,16777215,16777215,26367,36799,15921906,16777215,16777215,16777215,16777215,16777215,0,10921638,16777215,801923,16777215,16777215,16777215,16777215,16777215,16777215,15189684,16777215,11352,0,16777215,16777215,16777215,16777215,0,16777215,16777215,16777215,16777215,16777215,11854022,16777215,16777215,204,16777215,16777215,36799,3368601,16777215,16777215,2593979,16777215,3610052,16777215,8092539,7434613,16777215,49407,16777215,16777215,16777215,16777215,16777215,16777215,10086143,1137094,1137094,1137094,16777215,16777215,16772300,2315831,3506772,3506772,16777215,16777215,16777215,6740479,16777215,16777215]
[16777215,16777215,0,16777215,9359529,16764057,49407,1709849,4891128,8092539,16777215,16777215,666680,16777215,49407,3684410,16777215,16777215,16777215,16777215,16777215,16777215,16777215,5855577,16777215,0,15652797,10929378,6275299,6275299,6275299,6275299,6275299,6275299,6275299,6275299,6275299,6275299,10092543,10092543,12566463,14277081,5395026,16777215,12566463,26367,36799,0,16777215,16777215,16777215,13158,16777215,16777215,10921638,13158,801923,16777215,16777215,16777215,16777215,16777215,16777215,15773696,16777215,11352,0,4296113,16777215,16777215,0,0,16777215,16777215,16777215,16777215,16764057,16764057,16777215,13005646,204,16777215,16777215,36799,3368601,16777215,16777215,6275299,16777215,3610052,16777215,8092539,7434613,16777215,12566463,16777215,16777215,16777215,16777215,16777215,16777215,10086143,801923,801923,801923,16777215,16777215,16764057,3506772,3506772,6275299,16777215,16777215,0,16777215,16777215,16777215]
[16777215,16777215,0,16777215,9359529,9359529,16777215,1709849,801923,16777215,16777215,16777215,666680,0,49407,3684410,4210752,16777215,16777215,16777215,0,30882,16777215,5855577,16777215,4210752,15652797,13158,6275299,6275299,6275299,6275299,6275299,6275299,6275299,6275299,6275299,6275299,10092543,10092543,0,12566463,5395026,16777215,12566463,26367,36799,15921906,11352,0,16777215,16777215,16777215,16777215,13224393,13158,801923,16777215,16777215,16777215,16777215,16777215,16777215,3289655,16777215,11352,10921638,1589611,16777215,16777215,0,0,16777215,16777215,16777215,16764057,16764057,16777215,16764057,10954261,204,16777215,16777215,36799,3368601,16777215,16777215,6275299,16777215,3610052,0,16777215,7434613,16777215,0,16777215,16777215,16777215,16777215,16777215,16777215,10086143,801923,801923,801923,16777215,16777215,9359529,3506772,3506772,6275299,16777215,16777215,0,0,16777215,16777215]
[16777215,16777215,5934,192,9359529,9359529,16777215,1709849,1137094,16777215,0,16777215,666680,16777215,49407,666680,16777215,16777215,6567712,16777215,16777215,30882,16777215,7434613,16777215,0,15652797,10929378,6275299,6275299,6275299,6275299,6275299,6275299,6275299,6275299,6275299,6275299,10092543,10092543,16777215,12566463,5395026,16777215,12566463,204,36799,15921906,11352,16777215,16777215,13158,5395026,16777215,13224393,13294830,801923,3243501,16777215,16777215,16777215,16777215,16777215,16777215,16777215,11352,10921638,4296113,16777215,16777215,0,666680,801923,16777215,16777215,16764057,5935018,16777215,16764057,3561320,204,16777215,16777215,36799,3368601,16777215,801923,6275299,16777215,3610052,7434613,16777215,7434613,16777215,16777215,16777215,16777215,16777215,16777215,16777215,16777215,10086143,801923,0,0,16777215,0,9359529,3506772,3506772,6275299,16777215,16777215,0,16777215,192,16777215]
[16777215,16777215,5934,192,9359529,9359529,16777215,1709849,4891128,16777215,0,8092539,1799573,16777215,16777215,666680,0,16777215,16777215,16777215,16777215,19816,1137094,7434613,16777215,11573124,15652797,13158,6275299,6275299,6275299,6275299,6275299,6275299,6275299,6275299,6275299,6275299,10092543,10092543,16777215,12566463,5395026,16777215,12566463,16777215,36799,0,11352,16777215,16777215,0,5395026,16777215,14408667,13294830,2500134,3243501,16777215,16777215,16777215,16777215,16777215,16777215,16777215,11352,10921638,4296113,16777215,16777215,0,666680,801923,16777215,16777215,16777215,16777215,16777215,16777215,16777215,204,16777215,16777215,36799,3368601,1137094,801923,6275299,16777215,3610052,7434613,16777215,7434613,16777215,16777215,16777215,16777215,16777215,16777215,16777215,855309,10086143,801923,16777215,0,16777215,0,9359529,7434613,3368601,6275299,3506772,9359529,3506772,16777215,192,3506772]
[16777215,36799,11352,192,9359529,9359529,24704,16777215,801923,8092539,0,8092539,1799573,16777215,16777215,0,0,16777215,16777215,16777215,16777215,16777215,1137094,13553360,16777215,11573124,15652797,10929378,16728,1281739,16728,15773696,12611584,10498160,10925084,9465920,4525507,1424208,13382400,16764057,16777215,0,16777215,16777215,12566463,204,36799,16777215,11352,16777215,16777215,0,3684410,16777215,14408667,13294830,2500134,1137094,16777215,16777215,16777215,16777215,16777215,16777215,16777215,11352,10921638,4296113,16777215,16777215,0,14412,534356,16777215,16777215,16777215,16777215,16777215,16777215,16777215,16777215,16777215,16777215,36799,3368601,1137094,534356,6275299,16777215,3610052,7434613,16777215,7434613,16777215,16777215,16777215,16777215,16777215,16777215,16777215,855309,10086143,801923,16777215,16777215,3506772,0,9359529,7434613,3368601,1424208,3506772,3506772,3506772,16777215,192,3506772]
[10053375,36799,11352,16777215,9359529,9359529,49407,1709849,855309,8092539,16777215,8092539,1799573,16777215,16777215,0,16777215,16777215,16777215,16777215,16777215,16777215,1137094,13553360,16777215,16777215,15652797,10929378,16728,1281739,16728,15773696,12611584,10498160,10925084,9465920,4525507,1424208,13382400,16764057,16777215,0,16777215,16777215,16711680,204,36799,16777215,16777215,192,16777215,13158,16777215,16711680,14408667,13294830,2500134,16777215,16777215,16777215,16777215,16777215,16777215,3289655,16777215,11352,3684410,4296113,16777215,16777215,0,14412,16777215,16777215,16777215,16777215,5935018,16777215,16777215,3561320,16777215,16777215,16777215,36799,13158,16777215,16777215,2593979,16777215,3610052,0,16777215,5193523,16777215,16777215,16777215,16777215,16777215,16777215,16777215,16777215,801923,1137094,0,0,3506772,16777215,3506772,5193523,13158,1424208,2315831,3506772,3506772,16777215,16777215,3506772]
[3688550,36799,5934,16777215,9359529,9359529,49407,14083051,855309,8092539,16777215,8092539,1799573,16777215,49407,666680,0,3243501,3243501,16777215,16777215,16777215,1137094,7434613,0,11573124,15652797,13158,16728,1281739,16728,15773696,12611584,10498160,10925084,9465920,4525507,1424208,13382400,16764057,16777215,16777215,16777215,42752,5855577,204,16777215,16777215,16777215,192,16777215,13158,16777215,3684410,13224393,13294830,801923,16777215,16777215,1137094,16777215,5395026,3289655,3289655,0,11352,0,4296113,16777215,16777215,0,666680,16777215,11141282,8696052,16777215,5935018,16777215,16777215,3561320,16777215,16777215,15921906,16777215,13158,16777215,16777215,2593979,16777215,3610052,0,16777215,5193523,16777215,16777215,16777215,16777215,5395026,4210752,0,16777215,801923,1137094,0,0,16777215,16777215,19816,5193523,13158,1424208,3506772,3506772,3506772,16777215,16777215,3506772]
[3688550,36799,5934,16777215,19816,19816,49407,1709849,2500134,8092539,16777215,8092539,1799573,255,49407,666680,0,15921906,15921906,10689949,255,19816,1137094,7434613,16777215,11573124,15652797,10929378,16728,1281739,16728,15773696,12611584,10498160,10925084,9465920,4525507,1424208,13382400,16764057,16777215,0,16777215,42752,0,204,36799,0,16777215,16777215,36799,13158,16777215,0,13224393,13294830,801923,16777215,36799,1137094,13408767,5395026,3289655,3289655,11447982,16777215,3684410,4296113,16777215,15921906,36799,666680,16777215,11141282,8696052,16764057,16764057,16764057,16764057,15454147,16777215,16777215,16777215,36799,16777215,1137094,16777215,1799573,4210752,3610052,0,16777215,16777215,36799,16777215,36799,16777215,5395026,5296274,13224393,855309,1137094,1137094,1137094,1137094,36799,16777215,19816,16777215,16777215,1424208,3506772,3506772,3506772,255,16777215,3506772]
[3688550,36799,5934,192,19816,19816,49407,1709849,200223,8092539,0,14277081,0,16777215,49407,666680,0,15921906,15921906,9145333,16777215,30882,1137094,7434613,16777215,11573124,0,13158,0,0,0,0,0,0,0,0,0,0,0,0,0,12566463,16777215,42752,5855577,6740479,36799,0,16777215,16777215,36799,13158,3684410,3684410,13224393,13294830,801923,1137094,36799,1137094,13408767,5395026,3289655,3289655,11447982,16777215,3684410,4296113,16777215,15921906,36799,666680,534356,11141282,8696052,16764057,16764057,16764057,16764057,15454147,16777215,16777215,16382457,36799,13158,1137094,534356,0,4210752,16777215,0,16777215,5193523,36799,0,36799,36799,5395026,5296274,13224393,855309,0,1137094,1137094,1137094,36799,0,19816,5193523,13158,0,3506772,3506772,3506772,16777215,192,3506772]
[10053375,36799,0,192,19816,19816,49407,14083051,200223,8092539,0,14277081,0,16777215,49407,0,0,15921906,15921906,5263615,16777215,30882,1137094,7434613,16777215,11573124,10498160,16777215,0,0,0,0,0,0,0,0,0,0,0,0,12566463,14277081,16777215,42752,0,6740479,36799,0,11352,12566463,36799,16777215,5395026,0,16777215,13158,801923,3243501,36799,1137094,13408767,5395026,3289655,3289655,12566463,11352,0,16777215,11838,15921906,36799,0,801923,11141282,8696052,16764057,16764057,16764057,16764057,15454147,16777215,11838,16777215,36799,13158,16777215,801923,0,4210752,16777215,0,16777215,5193523,36799,12566463,36799,36799,5395026,6740479,16777215,16777215,0,1137094,1137094,1137094,36799,0,19816,5193523,13158,0,36799,3506772,36799,16777215,192,3289655]
[3688550,36799,0,192,16777215,16777215,49407,1709849,2500134,8092539,0,8092539,16777215,255,49407,0,0,3243501,3243501,293628,255,16777215,1137094,7434613,16764159,11573124,10498160,16777215,0,0,0,0,0,0,0,0,0,0,0,0,14277081,14277081,16777215,5789690,5855577,204,36799,16777215,11352,12566463,36799,16777215,5395026,3684410,16777215,13158,801923,3243501,36799,1137094,13408767,8092539,3289655,3289655,12566463,11352,3684410,16777215,11838,15921906,36799,0,801923,5789690,8696052,16764057,16764057,16764057,16764057,15454147,16777215,11838,16777215,36799,13158,16777215,801923,1799573,4210752,16777215,7434613,8092539,5193523,36799,14277081,36799,36799,5395026,6740479,13224393,16777215,1137094,1137094,1137094,1137094,36799,0,16777215,5193523,13158,0,36799,13224393,36799,255,192,3289655]
[3688550,36799,5934,16777215,16777215,16777215,49407,1709849,16777215,8092539,16777215,8092539,16777215,16777215,49407,666680,10225233,801923,0,49407,16777215,16777215,1137094,7434613,16764159,10921638,10498160,16777215,0,0,0,0,0,0,0,0,0,0,0,0,14277081,14277081,16777215,656128,16711680,6740479,36799,16777215,11352,12566463,36799,16777215,16777215,16711680,16777215,6966,801923,16777215,36799,0,13408767,8092539,3289655,3289655,11447982,11352,10921638,16777215,11838,15921906,36799,666680,16777215,656128,8696052,16764057,16764057,16764057,16764057,15454147,16777215,11838,16777215,36799,3368601,16777215,16777215,16777215,4210752,16777215,7434613,6740479,7434613,192,14277081,36799,36799,5395026,5287936,13224393,16777215,16777215,0,1137094,1137094,36799,16777215,3506772,7434613,3368601,0,192,13224393,36799,16777215,16777215,3289655]
[3688550,36799,11352,16777215,192,192,49407,14083051,16777215,8092539,16777215,8092539,16777215,14412,49407,0,10225233,801923,0,65535,14412,16777215,1137094,13553360,16777215,10921638,0,16777215,16777215,16777215,16777215,16777215,16777215,16777215,16777215,16777215,16777215,16777215,16777215,16777215,16777215,9359529,16777215,5789690,16711680,204,36799,16777215,0,12566463,36799,16777215,16777215,16711680,16777215,6966,801923,16777215,36799,0,13408767,8092539,3289655,3289655,12566463,0,16777215,16777215,11838,15921906,36799,14412,16777215,5789690,3684410,10017782,10017782,10017782,10017782,0,16777215,11838,16777215,36799,3368601,16777215,16777215,16777215,4210752,16777215,7434613,6740479,7434613,36799,14277081,36799,36799,5395026,855309,16777215,16777215,16777215,255,1137094,1137094,36799,16777215,3506772,7434613,3368601,3506772,36799,16777215,36799,14412,16777215,3289655]
[3688550,36799,16777215,16777215,192,192,49407,14083051,16777215,8092539,16777215,8092539,16777215,16777215,49407,16777215,10225233,15921906,15921906,5296274,16777215,16777215,6740479,16777215,16777215,10921638,15652797,16777215,16777215,16777215,16777215,16777215,16777215,16777215,16777215,16777215,16777215,16777215,16777215,16777215,14277081,8421504,16777215,42752,16711680,6740479,36799,16777215,11352,12566463,36799,16777215,16777215,16711680,16777215,13294830,10086143,16777215,36799,1137094,13408767,8092539,3289655,3289655,11447982,11352,16777215,16777215,11838,15921906,36799,16777215,16777215,11141282,8696052,10017782,10017782,10017782,10017782,0,16777215,11838,16777215,36799,3368601,16777215,16777215,16777215,4210752,16777215,7434613,6740479,7434613,36799,14277081,36799,36799,5395026,855309,16777215,16777215,16777215,255,0,0,36799,16777215,3506772,7434613,3368601,3506772,36799,16777215,36799,16777215,16777215,3289655]
[16777215,16777215,16777215,0,192,192,49407,1709849,16777215,8092539,3243501,8092539,16777215,16777215,49407,16777215,10225233,15921906,15921906,16777215,16777215,19816,1137094,16777215,16777215,10921638,15652797,16777215,16777215,16777215,16777215,16777215,16777215,16777215,16777215,16777215,16777215,16777215,16777215,16777215,14277081,11854022,16777215,42752,16711680,6740479,36799,16777215,16777215,6740479,16777215,16777215,0,16711680,16777215,13294830,10086143,192,16777215,1137094,16777215,16777215,16777215,3289655,11447982,16777215,16777215,16777215,11838,16777215,16777215,16777215,1137094,11141282,3684410,10017782,10017782,10017782,10017782,0,16777215,11838,16777215,36799,3368601,16777215,0,16777215,16777215,16777215,4210752,8092539,7434613,16777215,14277081,16777215,36799,16777215,855309,16777215,16777215,16777215,0,255,255,16777215,3243501,192,7434613,3368601,3506772,16777215,16777215,16777215,16777215,0,16777215]
[16777215,16777215,16777215,16777215,9359529,9359529,16777215,16777215,855309,16777215,16777215,16777215,1799573,16777215,16777215,16777215,16777215,16777215,16777215,16777215,16777215,16777215,16777215,16777215,16777215,16777215,16777215,10929378,16728,1281739,16728,15773696,12611584,10498160,10925084,9465920,4525507,1424208,13382400,16764057,16777215,16777215,16777215,16777215,16777215,16777215,36799,0,11352,801923,16777215,16777215,16777215,0,10921638,16777215,16777215,16777215,16777215,16777215,16777215,16777215,16777215,16777215,16777215,11352,16777215,16777215,16777215,16777215,16777215,16777215,16777215,16777215,16777215,16777215,16777215,16777215,16777215,16777215,204,16777215,16777215,36799,3368601,16777215,16777215,2593979,16777215,16777215,16777215,16777215,7434613,16777215,16777215,16777215,16777215,16777215,16777215,16777215,16777215,801923,0,0,13434828,16777215,16777215,9359529,7434613,3368601,1424208,16777215,16777215,16777215,3506772,16777215,16777215]
[16777215,16777215,0,16777215,9359529,9359529,16777215,16777215,855309,16777215,16777215,16777215,1799573,16777215,16777215,3684410,16777215,16777215,16777215,16777215,16777215,16777215,16777215,5855577,16777215,16777215,0,10929378,16728,1281739,16728,15773696,12611584,10498160,10925084,9465920,4525507,1424208,13382400,16764057,16777215,0,16777215,16777215,16777215,16777215,36799,0,11352,801923,16777215,16777215,16777215,0,11389944,16777215,16777215,16777215,16777215,16777215,16777215,16777215,16777215,16777215,16777215,11352,0,16777215,16777215,16777215,16777215,0,16777215,16777215,16777215,16777215,16777215,16777215,16777215,16777215,204,16777215,16777215,36799,3368601,16777215,16777215,2593979,16777215,3610052,16777215,16777215,7434613,16777215,16777215,16777215,16777215,16777215,16777215,16777215,16777215,801923,8696052,1137094,13434828,16777215,16777215,9359529,7434613,3368601,1424208,16777215,16777215,16777215,3506772,16777215,16777215]
[16777215,16777215,0,16777215,9359529,16772300,16777215,16777215,855309,16777215,16777215,16777215,1799573,6740479,16777215,3684410,16777215,16777215,16777215,16777215,6740479,16777215,16777215,5855577,16777215,16777215,15652797,13158,16728,1281739,16728,15773696,12611584,10498160,10925084,9465920,4525507,1424208,13382400,16764057,0,49407,3684410,16777215,16777215,16777215,36799,0,16777215,16777215,16777215,16777215,16777215,0,10921638,16777215,16777215,16777215,16777215,16777215,16777215,16777215,16777215,16777215,16777215,11352,0,16777215,16777215,16777215,16777215,0,16777215,16777215,16777215,16777215,16777215,11854022,16777215,16777215,204,16777215,16777215,36799,3368601,16777215,16777215,2593979,16777215,16777215,16777215,16777215,7434613,16777215,0,16777215,16777215,16777215,16777215,16777215,16777215,801923,1137094,1137094,13434828,16777215,16777215,16772300,7434613,3368601,1424208,16777215,16777215,16777215,3506772,16777215,16777215]
[16777215,16777215,0,16777215,9359529,16772300,16777215,16777215,855309,16777215,16777215,16777215,1799573,6740479,49407,3684410,16777215,16777215,16777215,16777215,6740479,16777215,16777215,5855577,16777215,16777215,15652797,13158,16728,1281739,16728,15773696,12611584,10498160,10925084,9465920,4525507,1424208,13382400,16764057,11389944,49407,3684410,16777215,12566463,16777215,36799,15921906,16777215,16777215,16777215,16777215,16777215,16777215,10921638,16777215,16777215,16777215,16777215,16777215,16777215,16777215,16777215,14395790,4539865,11352,0,16777215,16777215,16777215,16777215,0,16777215,16777215,16777215,16777215,16764057,11854022,16777215,10954261,204,16777215,16777215,36799,3368601,16777215,16777215,2593979,16777215,16777215,16777215,16777215,7434613,16777215,49407,16777215,16777215,16777215,16777215,16777215,16777215,801923,1137094,1137094,13434828,16777215,16777215,16772300,3506772,3506772,1424208,16777215,16777215,16777215,3506772,16777215,16777215]
[16777215,16777215,0,16777215,9359529,16772300,16777215,1709849,1137094,16777215,16777215,16777215,1799573,16777215,49407,3684410,0,16777215,16777215,16777215,16777215,16777215,16777215,5855577,16777215,11573124,15652797,13158,16728,1281739,16728,15773696,12611584,10498160,10925084,9465920,4525507,1424208,13382400,16764057,11389944,14277081,3684410,16777215,12566463,16777215,36799,15921906,16777215,16777215,16777215,16777215,16777215,16777215,10921638,16777215,16777215,16777215,16777215,16777215,16777215,16777215,16777215,15189684,16777215,11352,0,16777215,16777215,16777215,16777215,0,16777215,16777215,16777215,16764057,16764057,11854022,16764057,10954261,204,16777215,16777215,36799,3368601,16777215,16777215,2593979,16777215,3610052,16777215,16777215,7434613,16777215,49407,16777215,16777215,16777215,16777215,16777215,16777215,10086143,801923,801923,13434828,16777215,16777215,16772300,2315831,3506772,3506772,16777215,16777215,16777215,16777215,16777215,16777215]
[16777215,16777215,0,16777215,9359529,9359529,16777215,1709849,4891128,16777215,16777215,16777215,1799573,0,49407,3684410,0,16777215,6567712,16777215,0,16777215,16777215,5855577,16777215,11573124,15652797,13158,6275299,6275299,6275299,6275299,6275299,6275299,6275299,6275299,6275299,6275299,10092543,10092543,0,14277081,5395026,16777215,12566463,16777215,36799,15921906,16777215,0,16777215,16777215,16777215,16777215,10921638,16777215,801923,16777215,16777215,16777215,16777215,16777215,16777215,15189684,16777215,11352,10921638,16777215,16777215,16777215,16777215,0,16777215,16777215,16777215,16764057,16764057,16777215,16764057,10954261,204,16777215,16777215,36799,3368601,16777215,16777215,6275299,16777215,3610052,0,16777215,7434613,16777215,0,16777215,16777215,16777215,16777215,16777215,16777215,10086143,0,801923,0,16777215,16777215,9359529,3506772,3506772,6275299,16777215,16777215,16777215,0,16777215,16777215]
[16777215,16777215,5934,16777215,9359529,9359529,16777215,1709849,801923,16777215,16777215,16777215,1799573,16777215,49407,666680,0,16777215,16777215,16777215,16777215,30882,16777215,7434613,16777215,11573124,15652797,13158,6275299,6275299,6275299,6275299,6275299,6275299,6275299,6275299,6275299,6275299,10092543,10092543,16777215,12566463,5395026,16777215,12566463,16777215,36799,15921906,11352,16777215,16777215,13158,16777215,16777215,10921638,13158,801923,16777215,16777215,16777215,16777215,16777215,16777215,16777215,16777215,11352,10921638,4296113,16777215,16777215,16777215,666680,16777215,16777215,16777215,16764057,16777215,16777215,16764057,16777215,204,16777215,16777215,36799,3368601,16777215,16777215,6275299,16777215,3610052,0,16777215,7434613,16777215,16777215,16777215,16777215,16777215,16777215,16777215,16777215,10086143,0,0,0,16777215,16777215,9359529,3506772,2315831,6275299,16777215,16777215,16777215,16777215,16777215,16777215]
[16777215,16777215,5934,192,9359529,9359529,16777215,1709849,1137094,16777215,0,16777215,1799573,16777215,16777215,666680,0,16777215,16777215,16777215,16777215,30882,16777215,7434613,16777215,11573124,15652797,10929378,6275299,6275299,6275299,6275299,6275299,6275299,6275299,6275299,6275299,6275299,10092543,10092543,16777215,0,5395026,16777215,12566463,16777215,36799,0,11352,16777215,16777215,13158,5395026,16777215,10921638,13158,801923,3243501,16777215,16777215,16777215,16777215,16777215,16777215,16777215,11352,10921638,4296113,16777215,16777215,16777215,666680,801923,16777215,16777215,16777215,16777215,16777215,16777215,16777215,204,16777215,16777215,36799,3368601,16777215,801923,6275299,16777215,3610052,0,16777215,7434613,16777215,16777215,16777215,16777215,16777215,16777215,16777215,16777215,10086143,0,0,0,16777215,0,9359529,3506772,3506772,6275299,16777215,16777215,16777215,16777215,192,16777215]
[16777215,16777215,5934,192,9359529,9359529,24704,1709849,855309,16777215,0,16777215,1799573,16777215,16777215,666680,0,16777215,16777215,16777215,16777215,19816,16777215,7434613,16777215,11573124,15652797,13158,16728,1281739,16728,15773696,12611584,10498160,10925084,9465920,4525507,1424208,13382400,16764057,16777215,0,16777215,16777215,12566463,16777215,36799,0,16777215,16777215,16777215,0,5395026,16777215,10921638,13294830,2500134,3243501,16777215,16777215,16777215,16777215,16777215,16777215,16777215,11352,10921638,4296113,16777215,16777215,16777215,666680,801923,16777215,16777215,16777215,5935018,16777215,16777215,3561320,16777215,16777215,16777215,36799,3368601,1137094,801923,2593979,16777215,3610052,0,16777215,7434613,16777215,16777215,16777215,16777215,16777215,16777215,16777215,855309,801923,0,16777215,16777215,16777215,0,9359529,7434613,3368601,1424208,16777215,3506772,16777215,16777215,192,16777215]
[10053375,36799,5934,192,9359529,9359529,16777215,16777215,855309,16777215,0,16777215,1799573,666680,16777215,666680,16777215,16777215,16777215,16777215,666680,16777215,16777215,7434613,16777215,16777215,15652797,13158,16728,1281739,16728,15773696,12611584,10498160,10925084,9465920,4525507,1424208,13382400,16764057,16777215,16777215,16777215,16777215,12566463,204,36799,0,16777215,666680,16777215,13158,3684410,16777215,10921638,13294830,2500134,1137094,16777215,16777215,16777215,16777215,16777215,16777215,16777215,11352,10921638,4296113,16777215,16777215,0,666680,534356,16777215,16777215,16777215,5935018,16777215,16777215,3561320,16777215,16777215,16777215,36799,3368601,1137094,534356,2593979,16777215,3610052,0,16777215,7434613,16777215,16777215,16777215,16777215,16777215,16777215,16777215,855309,801923,801923,16777215,16777215,16777215,0,9359529,7434613,3368601,1424208,16777215,3506772,0,666680,192,16777215]
[16777215,36799,11352,16777215,9359529,9359529,16777215,5263191,855309,16777215,16777215,14277081,1799573,16777215,16777215,0,16777215,16777215,16777215,16777215,16777215,16777215,1137094,13553360,16777215,16777215,15652797,10929378,16728,1281739,16728,15773696,12611584,10498160,10925084,9465920,4525507,1424208,13382400,16764057,16777215,16777215,16777215,16777215,16711680,204,36799,16777215,16777215,16777215,16777215,13158,16777215,16711680,16777215,13294830,2500134,16777215,16777215,16777215,16777215,16777215,16777215,16777215,16777215,11352,3684410,4296113,16777215,16777215,16777215,14412,16777215,16777215,16777215,16777215,16777215,16777215,16777215,16777215,16777215,16777215,16777215,36799,16777215,16777215,16777215,2593979,16777215,3610052,0,16777215,16777215,16777215,16777215,16777215,16777215,16777215,16777215,16777215,16777215,801923,1137094,16777215,16777215,16777215,16777215,3506772,2315831,2315831,1424208,2315831,3506772,3506772,16777215,16777215,3506772]
[3688550,36799,5934,16777215,9359529,9359529,49407,14083051,855309,8092539,16777215,14277081,1799573,16777215,49407,666680,0,15921906,15921906,16777215,16777215,16777215,1137094,7434613,16777215,11573124,15652797,13158,16728,1281739,16728,15773696,12611584,10498160,10925084,9465920,4525507,1424208,13382400,16764057,16777215,16777215,16777215,42752,5855577,204,16777215,16777215,16777215,192,16777215,16777215,16777215,3684410,16777215,13294830,801923,16777215,16777215,1137094,16777215,16777215,3289655,3289655,16777215,16777215,3684410,4296113,16777215,16777215,0,666680,16777215,11141282,8696052,16777215,16777215,16777215,16777215,16777215,16777215,16777215,16777215,16777215,13158,16777215,16777215,2593979,16777215,3610052,0,16777215,5193523,16777215,16777215,16777215,16777215,16777215,16777215,16777215,16777215,801923,1137094,0,0,16777215,16777215,3506772,5193523,13158,1424208,3506772,9359529,3506772,16777215,16777215,3506772]
[3688550,36799,0,16777215,19816,19816,49407,1709849,855309,8092539,16777215,8092539,1799573,16777215,49407,0,0,3243501,3243501,16777215,16777215,19816,1137094,0,0,11573124,15652797,10929378,16728,1281739,16728,15773696,12611584,10498160,10925084,9465920,4525507,1424208,13382400,16764057,16777215,16777215,16777215,42752,5855577,204,16777215,16777215,16777215,192,16777215,13158,16777215,3684410,16777215,13294830,801923,16777215,16777215,1137094,16777215,5395026,3289655,3289655,0,16777215,3684410,4296113,16777215,16777215,16777215,0,16777215,11141282,8696052,16764057,16764057,16764057,16764057,16764299,16777215,16777215,15921906,16777215,13158,1137094,16777215,2593979,16777215,3610052,0,16777215,5193523,16777215,16777215,16777215,16777215,5395026,4210752,0,855309,801923,1137094,1137094,1137094,16777215,16777215,3506772,5193523,13158,1424208,3506772,3506772,3506772,16777215,16777215,3506772]
[3688550,36799,0,192,19816,19816,49407,14083051,200223,8092539,0,14277081,1799573,255,49407,0,0,3243501,3243501,9145333,255,30882,1137094,0,16777215,11573124,15652797,16777215,16728,1281739,16728,15773696,12611584,10498160,10925084,9465920,4525507,1424208,13382400,16764057,16777215,0,16777215,42752,5855577,6740479,36799,16777215,16777215,192,36799,13158,3684410,3684410,16777215,13158,801923,1137094,36799,1137094,16777215,5395026,3289655,3289655,3175320,16777215,3684410,4296113,16777215,15921906,36799,0,534356,11141282,8696052,16764057,16764057,16764057,16764057,16764299,16777215,16777215,16777215,36799,16777215,1137094,534356,0,4210752,16777215,0,16777215,16777215,192,16777215,36799,36799,5395026,5296274,13224393,855309,0,1137094,1137094,1137094,36799,0,3506772,16777215,16777215,1424208,192,3506772,36799,255,192,3289655]
[3688550,36799,0,192,19816,19816,49407,14083051,200223,8092539,0,12566463,16777215,255,49407,0,0,3243501,3243501,5263615,255,30882,1137094,0,16777215,11573124,0,16777215,16728,1281739,16728,15773696,12611584,10498160,10925084,9465920,4525507,1424208,13382400,16764057,0,12566463,16777215,42752,5855577,204,36799,16777215,16777215,192,36799,13158,5395026,3684410,16777215,13158,801923,3243501,36799,1137094,13408767,5395026,3289655,3289655,11447982,16777215,3684410,4296113,16777215,15921906,36799,0,801923,11141282,8696052,16764057,16764057,16764057,16764057,16764299,16777215,16777215,16777215,36799,16777215,16777215,801923,0,4210752,16777215,0,16777215,16777215,192,0,36799,36799,5395026,5296274,16777215,16777215,0,1137094,1137094,1137094,36799,0,3506772,16777215,16777215,1424208,192,3506772,36799,255,192,3289655]
[10053375,36799,0,192,16777215,16777215,49407,1709849,16777215,8092539,0,12566463,16777215,16777215,49407,0,0,15921906,15921906,293628,16777215,16777215,1137094,0,16764159,11573124,10498160,16777215,16728,1281739,16728,15773696,12611584,10498160,10925084,9465920,4525507,1424208,13382400,16764057,12566463,14277081,16777215,5789690,5855577,6740479,36799,16777215,16777215,16777215,36799,16777215,5395026,3684410,16777215,13158,801923,3243501,36799,1137094,13408767,8092539,3289655,3289655,12566463,16777215,3684410,16777215,11838,15921906,36799,0,801923,5789690,8696052,16764057,16764057,16764057,16764057,16764299,16777215,11838,16777215,36799,13158,16777215,801923,16777215,4210752,16777215,0,8092539,5193523,192,12566463,12611584,36799,5395026,6740479,13224393,16777215,16777215,1137094,1137094,1137094,36799,0,3506772,5193523,13158,1424208,192,13224393,36799,16777215,192,3289655]
[3688550,36799,5934,16777215,16777215,16777215,49407,14083051,16777215,8092539,16777215,8092539,16777215,666680,49407,666680,10225233,801923,0,49407,666680,16777215,1137094,7434613,16777215,10921638,0,16777215,16777215,16777215,16777215,16777215,16777215,16777215,16777215,16777215,16777215,16777215,16777215,16777215,14277081,14277081,16777215,5789690,16711680,204,36799,16777215,11352,666680,36799,16777215,16777215,16711680,16777215,13158,801923,16777215,36799,0,13408767,8092539,3289655,3289655,12566463,11352,16777215,16777215,11838,15921906,36799,666680,16777215,5789690,8696052,16764057,16764057,16764057,16764057,16764299,16777215,11838,16777215,36799,3368601,16777215,16777215,16777215,4210752,16777215,0,6740479,7434613,36799,14277081,36799,36799,5395026,6740479,16777215,16777215,16777215,1137094,1137094,1137094,36799,16777215,3506772,7434613,3368601,3506772,36799,16777215,36799,666680,16777215,3289655]
[3688550,36799,16777215,16777215,192,192,49407,14083051,16777215,8092539,16777215,8092539,16777215,16777215,49407,16777215,0,15921906,15921906,65535,16777215,16777215,1137094,16777215,16777215,11573124,15652797,16777215,16777215,16777215,16777215,16777215,16777215,16777215,16777215,16777215,16777215,16777215,16777215,16777215,16777215,11854022,16777215,5789690,16711680,6740479,36799,16777215,11352,16777215,36799,16777215,16777215,16711680,16777215,13158,801923,16777215,36799,1137094,13408767,16777215,3289655,3289655,12566463,11352,16777215,16777215,11838,15921906,36799,16777215,16777215,5789690,8696052,16764057,16764057,16764057,16764057,16764299,16777215,11838,16777215,36799,0,16777215,16777215,16777215,4210752,16777215,7434613,8092539,0,36799,14277081,36799,36799,5395026,5287936,16777215,16777215,16777215,0,1137094,1137094,36799,16777215,3506772,0,0,3506772,36799,16777215,36799,16777215,16777215,3289655]
[3688550,36799,16777215,16777215,192,192,49407,1709849,16777215,8092539,16777215,8092539,16777215,16777215,49407,16777215,10225233,15921906,15921906,5296274,16777215,16777215,6740479,16777215,16777215,10921638,15652797,16777215,16777215,16777215,16777215,16777215,16777215,16777215,16777215,16777215,16777215,16777215,16777215,16777215,14277081,11854022,16777215,42752,16711680,204,36799,16777215,16777215,16777215,36799,16777215,16777215,16711680,16777215,13294830,10086143,16777215,36799,1137094,13408767,16777215,3289655,3289655,11447982,16777215,16777215,16777215,11838,15921906,36799,16777215,16777215,11141282,8696052,10017782,10017782,10017782,5935018,0,16777215,11838,16382457,36799,3368601,16777215,16777215,16777215,4210752,16777215,7434613,6740479,7434613,36799,14277081,36799,36799,16777215,4210752,16777215,16777215,16777215,255,1137094,1137094,36799,16777215,192,7434613,3368601,3506772,36799,16777215,36799,16777215,16777215,3289655]
[16777215,16777215,16777215,16777215,192,192,49407,14083051,16777215,8092539,16777215,8092539,16777215,16777215,49407,16777215,10225233,15921906,15921906,16777215,16777215,16777215,1137094,16777215,16777215,10921638,15652797,16777215,16777215,16777215,16777215,16777215,16777215,16777215,16777215,16777215,16777215,16777215,16777215,16777215,16777215,3506772,16777215,42752,16711680,6740479,36799,16777215,16777215,16777215,16777215,16777215,16777215,16711680,16777215,13294830,10086143,16777215,16777215,1137094,16777215,16777215,16777215,3289655,11447982,16777215,16777215,16777215,11838,16777215,16777215,16777215,16777215,11141282,8696052,10017782,10017782,10017782,5935018,0,16777215,11838,16777215,36799,0,16777215,16777215,16777215,16777215,16777215,4210752,8092539,0,16777215,14277081,16777215,36799,16777215,855309,13224393,16777215,16777215,0,0,0,16777215,16777215,192,0,0,16777215,16777215,13224393,16777215,16777215,16777215,16777215]
[16777215,16777215,16777215,16777215,9359529,9359529,16777215,16777215,855309,16777215,16777215,16777215,1799573,16777215,16777215,16777215,16777215,16777215,16777215,16777215,16777215,16777215,16777215,16777215,16777215,16777215,16777215,10929378,16728,1281739,16728,15773696,12611584,10498160,10925084,9465920,4525507,1424208,13382400,16764057,16777215,16777215,16777215,16777215,16777215,16777215,36799,0,11352,801923,16777215,16777215,16777215,0,10921638,16777215,16777215,16777215,16777215,16777215,16777215,16777215,16777215,16777215,16777215,11352,16777215,16777215,16777215,16777215,16777215,16777215,16777215,16777215,16777215,16777215,16777215,16777215,16777215,16777215,204,16777215,16777215,36799,3368601,16777215,16777215,2593979,16777215,16777215,16777215,16777215,7434613,16777215,16777215,16777215,16777215,16777215,16777215,16777215,16777215,801923,0,0,13434828,16777215,16777215,9359529,7434613,3368601,1424208,16777215,16777215,16777215,3506772,16777215,16777215]
[16777215,16777215,0,16777215,9359529,9359529,16777215,16777215,855309,16777215,16777215,16777215,1799573,16777215,16777215,3684410,16777215,16777215,16777215,16777215,16777215,16777215,16777215,5855577,16777215,16777215,16777215,10929378,16728,1281739,16728,15773696,12611584,10498160,10925084,9465920,4525507,1424208,13382400,16764057,16777215,0,16777215,16777215,16777215,16777215,36799,0,11352,801923,16777215,16777215,16777215,0,10921638,16777215,16777215,16777215,16777215,16777215,16777215,16777215,16777215,16777215,16777215,11352,0,16777215,16777215,16777215,16777215,0,16777215,16777215,16777215,16777215,16777215,16777215,16777215,16777215,204,16777215,16777215,36799,3368601,16777215,16777215,2593979,16777215,16777215,16777215,16777215,7434613,16777215,16777215,16777215,16777215,16777215,16777215,16777215,16777215,801923,8696052,801923,13434828,16777215,16777215,9359529,7434613,3368601,1424208,16777215,16777215,16777215,3506772,16777215,16777215]
[16777215,16777215,0,16777215,9359529,9359529,16777215,16777215,855309,16777215,16777215,16777215,1799573,6740479,16777215,3684410,16777215,16777215,16777215,16777215,6740479,16777215,16777215,5855577,16777215,16777215,0,13158,16728,1281739,16728,15773696,12611584,10498160,10925084,9465920,4525507,1424208,13382400,16764057,16777215,49407,3684410,16777215,16777215,16777215,36799,0,11352,16777215,16777215,16777215,16777215,0,10921638,16777215,16777215,16777215,16777215,16777215,16777215,16777215,16777215,16777215,16777215,11352,0,16777215,16777215,16777215,16777215,0,16777215,16777215,16777215,16777215,16777215,16777215,16777215,16777215,204,16777215,16777215,36799,3368601,16777215,16777215,2593979,16777215,3610052,16777215,16777215,7434613,16777215,16777215,16777215,16777215,16777215,16777215,16777215,16777215,801923,801923,801923,13434828,16777215,16777215,9359529,7434613,3368601,1424208,16777215,16777215,16777215,3506772,16777215,16777215]
[16777215,16777215,0,16777215,9359529,9359529,16777215,16777215,855309,16777215,16777215,16777215,1799573,16777215,16777215,3684410,16777215,16777215,16777215,16777215,16777215,16777215,16777215,5855577,16777215,16777215,0,7998,16728,1281739,16728,15773696,12611584,10498160,10925084,9465920,4525507,1424208,13382400,16764057,0,0,3684410,16777215,12566463,16777215,36799,0,11352,16777215,16777215,16777215,16777215,16777215,10921638,16777215,16777215,16777215,16777215,16777215,16777215,16777215,16777215,16777215,4539865,11352,0,16777215,16777215,16777215,16777215,0,16777215,16777215,16777215,16777215,16777215,16777215,16777215,16777215,204,16777215,16777215,36799,3368601,16777215,16777215,2593979,16777215,16777215,16777215,16777215,7434613,16777215,0,16777215,16777215,16777215,16777215,16777215,16777215,801923,801923,801923,13434828,16777215,16777215,9359529,3506772,3506772,1424208,16777215,16777215,16777215,3506772,16777215,16777215]
[16777215,16777215,0,16777215,9359529,9359529,16777215,16777215,855309,16777215,16777215,16777215,1799573,0,16777215,3684410,16777215,16777215,16777215,16777215,0,16777215,16777215,5855577,16777215,16777215,0,16777215,16728,1281739,16728,15773696,12611584,10498160,10925084,9465920,4525507,1424208,13382400,16764057,0,49407,3684410,16777215,12566463,16777215,36799,0,11352,0,16777215,16777215,16777215,16777215,10921638,16777215,16777215,16777215,16777215,16777215,16777215,16777215,16777215,16777215,16777215,11352,10921638,16777215,16777215,16777215,16777215,0,16777215,16777215,16777215,16777215,16777215,16777215,16777215,16777215,204,16777215,16777215,36799,3368601,16777215,16777215,2593979,16777215,3610052,16777215,16777215,7434613,16777215,0,16777215,16777215,16777215,16777215,16777215,16777215,801923,801923,801923,13434828,16777215,16777215,9359529,3506772,3506772,3506772,16777215,16777215,16777215,3506772,16777215,16777215]
[16777215,16777215,5934,16777215,9359529,9359529,16777215,1709849,4891128,16777215,16777215,16777215,1799573,16777215,16777215,666680,0,16777215,16777215,16777215,16777215,16777215,16777215,7434613,16777215,11573124,0,16777215,16728,1281739,16728,15773696,12611584,10498160,10925084,9465920,4525507,1424208,13382400,16764057,16777215,12566463,3684410,16777215,12566463,16777215,36799,0,11352,16777215,16777215,16777215,16777215,16777215,10921638,16777215,801923,16777215,16777215,16777215,16777215,16777215,16777215,16777215,16777215,11352,10921638,16777215,16777215,16777215,16777215,666680,16777215,16777215,16777215,16777215,16777215,16777215,16777215,16777215,204,16777215,16777215,36799,3368601,16777215,16777215,2593979,16777215,3610052,0,16777215,7434613,16777215,16777215,16777215,16777215,16777215,16777215,16777215,16777215,10086143,0,0,16777215,16777215,16777215,9359529,3506772,3506772,3506772,16777215,16777215,16777215,3506772,16777215,16777215]
[16777215,16777215,5934,16777215,9359529,9359529,16777215,1709849,801923,16777215,16777215,16777215,1799573,16777215,16777215,666680,0,16777215,16777215,16777215,16777215,30882,16777215,7434613,16777215,11573124,0,16777215,16728,1281739,16728,15773696,12611584,10498160,10925084,9465920,4525507,1424208,13382400,16764057,16777215,0,5395026,16777215,12566463,16777215,36799,0,11352,16777215,16777215,16777215,16777215,16777215,10921638,16777215,1137094,16777215,16777215,16777215,16777215,16777215,16777215,16777215,16777215,11352,10921638,16777215,16777215,16777215,16777215,666680,16777215,16777215,16777215,16777215,16777215,16777215,16777215,16777215,204,16777215,16777215,36799,3368601,16777215,16777215,2593979,16777215,3610052,0,16777215,7434613,16777215,16777215,16777215,16777215,16777215,16777215,16777215,16777215,10086143,0,16777215,16777215,16777215,16777215,9359529,3506772,2315831,3506772,16777215,16777215,16777215,16777215,16777215,16777215]
[16777215,16777215,5934,192,9359529,9359529,49407,1709849,855309,16777215,0,16777215,1799573,16777215,16777215,666680,0,16777215,16777215,16777215,16777215,30882,16777215,7434613,16777215,11573124,0,16777215,16728,1281739,16728,15773696,12611584,10498160,10925084,9465920,4525507,1424208,13382400,16764057,16777215,16777215,5395026,16777215,12566463,16777215,36799,0,16777215,16777215,16777215,0,5395026,16777215,10921638,13158,801923,3243501,16777215,16777215,16777215,16777215,16777215,16777215,16777215,11352,10921638,4296113,16777215,16777215,16777215,666680,801923,16777215,16777215,16777215,16777215,16777215,16777215,16777215,204,16777215,16777215,36799,3368601,16777215,801923,2593979,16777215,16777215,0,16777215,7434613,16777215,16777215,16777215,16777215,16777215,16777215,16777215,16777215,801923,16777215,16777215,16777215,16777215,0,9359529,3506772,3506772,3506772,16777215,16777215,16777215,16777215,192,16777215]
[16777215,16777215,5934,192,9359529,9359529,49407,16777215,855309,16777215,0,16777215,1799573,666680,16777215,666680,16777215,16777215,6567712,16777215,666680,5395026,16777215,7434613,16777215,16777215,15652797,16777215,16728,1281739,16728,15773696,12611584,10498160,10925084,9465920,4525507,1424208,13382400,16764057,16777215,16777215,16777215,16777215,12566463,204,36799,0,16777215,666680,16777215,13158,5395026,16777215,10921638,13294830,801923,3243501,16777215,16777215,16777215,16777215,16777215,16777215,16777215,11352,10921638,4296113,16777215,16777215,16777215,666680,801923,16777215,16777215,16777215,16777215,16777215,16777215,16777215,16777215,16777215,16777215,36799,16777215,1137094,801923,2593979,16777215,16777215,0,16777215,16777215,16777215,16777215,16777215,16777215,16777215,16777215,16777215,855309,801923,0,16777215,16777215,16777215,0,9359529,3506772,3506772,3506772,16777215,16777215,16777215,666680,192,16777215]
[16777215,16777215,16777215,0,9359529,9359529,49407,16777215,855309,16777215,3243501,16777215,1799573,16777215,16777215,16777215,16777215,16777215,16777215,16777215,16777215,16777215,16777215,16777215,16777215,16777215,15652797,16777215,16728,1281739,16728,15773696,12611584,10498160,10925084,9465920,4525507,1424208,13382400,16764057,16777215,16777215,16777215,16777215,12566463,204,36799,0,16777215,16777215,16777215,13158,0,16777215,10921638,13158,801923,0,16777215,16777215,16777215,16777215,16777215,16777215,16777215,16777215,10921638,4296113,16777215,16777215,16777215,16777215,0,16777215,16777215,16777215,16777215,16777215,16777215,16777215,16777215,16777215,16777215,36799,16777215,11184814,0,2593979,16777215,16777215,16777215,16777215,16777215,16777215,16777215,16777215,16777215,16777215,16777215,16777215,11184814,801923,0,16777215,16777215,16777215,3243501,3506772,3506772,3506772,3506772,16777215,16777215,16777215,3506772,0,16777215]
[16777215,16777215,11352,16777215,9359529,9359529,49407,16777215,855309,16777215,16777215,16777215,1799573,14412,16777215,0,16777215,16777215,16777215,16777215,14412,16777215,16777215,7434613,16777215,16777215,15652797,7998,16728,1281739,16728,15773696,12611584,10498160,10925084,9465920,4525507,1424208,13382400,16764057,16777215,16777215,16777215,16777215,16711680,204,36799,0,16777215,14412,16777215,13158,16777215,16711680,16777215,13158,801923,16777215,16777215,16777215,16777215,16777215,16777215,16777215,16777215,16777215,16777215,4296113,16777215,16777215,16777215,14412,16777215,16777215,16777215,16777215,16777215,16777215,16777215,16777215,16777215,16777215,16777215,36799,16777215,16777215,16777215,2593979,16777215,3610052,0,16777215,16777215,16777215,16777215,16777215,16777215,16777215,16777215,16777215,16777215,801923,801923,16777215,16777215,16777215,16777215,3506772,2315831,2315831,3506772,16777215,3506772,16777215,14412,16777215,16777215]
[3688550,36799,5934,16777215,9359529,9359529,49407,5263191,855309,16777215,16777215,16777215,1799573,16777215,49407,666680,16777215,16777215,16777215,16777215,16777215,16777215,16777215,7434613,16777215,16777215,15652797,13158,16728,1281739,16728,15773696,12611584,10498160,10925084,9465920,4525507,1424208,13382400,16764057,16777215,16777215,16777215,16777215,16711680,204,16777215,0,16777215,16777215,16777215,16777215,16777215,16711680,16777215,13294830,801923,16777215,16777215,16777215,16777215,16777215,3289655,16777215,16777215,16777215,3684410,1589611,16777215,16777215,0,666680,16777215,16777215,8696052,16777215,16777215,16777215,16777215,16777215,16777215,16777215,16777215,16777215,16777215,16777215,16777215,2593979,16777215,3610052,0,16777215,16777215,16777215,16777215,16777215,16777215,16777215,16777215,16777215,16777215,801923,1137094,16777215,16777215,16777215,16777215,3506772,3506772,3506772,3506772,16777215,3506772,0,16777215,16777215,3289655]
[3688550,36799,0,16777215,19816,19816,49407,1709849,855309,8092539,16777215,8092539,16777215,16777215,49407,0,0,15921906,0,16777215,16777215,5395026,1137094,7434613,0,11573124,15652797,13158,16728,1281739,16728,15773696,12611584,10498160,10925084,9465920,4525507,1424208,13382400,16764057,16777215,16777215,16777215,42752,5855577,204,16777215,16777215,16777215,16777215,16777215,204,16777215,3684410,16777215,13294830,1137094,16777215,16777215,1137094,16777215,5395026,3289655,3289655,0,16777215,3684410,1589611,16777215,16777215,16777215,0,16777215,11141282,8696052,16777215,16777215,16777215,16777215,16777215,16777215,16777215,15921906,16777215,13158,1137094,16777215,2593979,16777215,3610052,0,16777215,5193523,16777215,16777215,16777215,16777215,5395026,4210752,0,855309,801923,1137094,801923,801923,16777215,16777215,3506772,5193523,13158,3506772,16777215,3506772,16777215,16777215,16777215,3289655]
[3688550,36799,0,0,19816,19816,49407,14083051,855309,8092539,3243501,8092539,16777215,16777215,49407,0,0,15921906,15921906,9145333,16777215,30882,1137094,7434613,16777215,11573124,15652797,16777215,16728,1281739,16728,15773696,12611584,10498160,10925084,9465920,4525507,1424208,13382400,16764057,16777215,0,16777215,42752,5855577,204,36799,16777215,16777215,16777215,36799,16777215,0,3684410,16777215,13158,801923,0,36799,1137094,13408767,5395026,3289655,3289655,3175320,16777215,3684410,1589611,16777215,15921906,36799,0,0,11141282,8696052,16764057,16764057,16764057,16764057,14064512,16777215,16777215,16777215,36799,13158,11184814,0,2593979,4210752,16777215,0,16777215,5193523,36799,16777215,36799,16777215,5395026,5296274,13224393,11184814,801923,1137094,1137094,1137094,36799,3243501,3506772,5193523,13158,3506772,36799,13224393,36799,16777215,0,3289655]
[3688550,36799,5934,192,19816,19816,49407,1709849,855309,8092539,0,8092539,16777215,16777215,49407,666680,0,15921906,15921906,5263615,16777215,30882,1137094,7434613,16777215,11573124,0,16777215,16777215,16777215,16777215,16777215,16777215,16777215,16777215,16777215,16777215,16777215,16777215,16777215,0,12566463,16777215,42752,5855577,204,36799,16777215,16777215,16777215,36799,13158,5395026,3684410,16777215,13158,801923,3243501,36799,1137094,13408767,8092539,3289655,3289655,11447982,16777215,3684410,4296113,16777215,15921906,36799,666680,801923,11141282,8696052,16764057,16764057,16764057,16764057,14064512,16777215,16777215,16777215,36799,13158,16777215,801923,2593979,4210752,16777215,16777215,16777215,5193523,36799,0,36799,36799,5395026,5296274,16777215,16777215,801923,1137094,1137094,1137094,36799,0,3506772,5193523,13158,3506772,36799,16777215,36799,16777215,192,3289655]
[3688550,36799,5934,192,16777215,16777215,49407,1709849,16777215,8092539,0,8092539,16777215,16777215,49407,666680,0,15921906,15921906,293628,16777215,16777215,1137094,7434613,16764159,11573124,10498160,16777215,16777215,16777215,16777215,16777215,16777215,16777215,16777215,16777215,16777215,16777215,16777215,16777215,12566463,14277081,16777215,42752,16711680,204,36799,16777215,16777215,16777215,36799,16777215,5395026,16711680,16777215,13158,801923,3243501,36799,1137094,13408767,8092539,3289655,3289655,3175320,16777215,16777215,16777215,16777215,15921906,36799,666680,801923,11141282,8696052,16764057,16764057,16764057,16764057,14064512,16777215,16777215,15921906,36799,16777215,16777215,801923,16777215,4210752,16777215,16777215,8092539,16777215,36799,12566463,36799,36799,5395026,6740479,13224393,16777215,16777215,1137094,1137094,1137094,36799,0,3506772,16777215,16777215,3506772,36799,13224393,36799,16777215,192,3289655]
[3688550,36799,5934,16777215,16777215,16777215,49407,14083051,16777215,8092539,16777215,8092539,16777215,666680,49407,666680,0,15921906,15921906,49407,666680,16777215,1137094,7434613,16777215,11573124,0,16777215,16777215,16777215,16777215,16777215,16777215,16777215,16777215,16777215,16777215,16777215,16777215,16777215,14277081,14277081,16777215,42752,16711680,204,36799,16777215,16777215,666680,36799,16777215,16777215,16711680,16777215,13158,801923,16777215,36799,1137094,13408767,8092539,3289655,3289655,11447982,16777215,16777215,16777215,11838,16777215,36799,666680,16777215,11141282,8696052,16764057,16764057,16764057,16764057,14064512,16777215,11838,15921906,36799,16777215,16777215,16777215,16777215,4210752,16777215,0,8092539,16777215,36799,14277081,36799,36799,5395026,6740479,16777215,16777215,16777215,1137094,1137094,1137094,36799,16777215,3506772,16777215,16777215,3506772,36799,16777215,36799,666680,16777215,3289655]
[16777215,16777215,16777215,16777215,192,192,49407,1709849,16777215,8092539,16777215,16777215,16777215,16777215,49407,16777215,0,15921906,15921906,16777215,16777215,16777215,16777215,16777215,16777215,11573124,15652797,16777215,16777215,16777215,16777215,16777215,16777215,16777215,16777215,16777215,16777215,16777215,16777215,16777215,16777215,3506772,16777215,42752,16711680,204,36799,16777215,16777215,16777215,16777215,16777215,16777215,16711680,16777215,13158,801923,16777215,16777215,1137094,16777215,16777215,16777215,3289655,11447982,16777215,16777215,16777215,11838,16777215,16777215,16777215,16777215,11141282,8696052,16764057,16764057,16764057,16764057,14064512,16777215,11838,15921906,36799,16777215,16777215,16777215,16777215,16777215,16777215,0,8092539,16777215,16777215,14277081,16777215,36799,5395026,5287936,13224393,16777215,16777215,1137094,1137094,1137094,16777215,16777215,3506772,16777215,16777215,3506772,16777215,13224393,16777215,16777215,16777215,16777215]
[16777215,16777215,16777215,16777215,192,192,49407,1709849,16777215,8092539,16777215,16777215,16777215,16777215,16777215,16777215,0,15921906,15921906,16777215,16777215,16777215,16777215,16777215,16777215,11573124,15652797,16777215,16777215,16777215,16777215,16777215,16777215,16777215,16777215,16777215,16777215,16777215,16777215,16777215,14277081,14277081,16777215,42752,16711680,204,36799,16777215,16777215,16777215,16777215,16777215,16777215,16711680,16777215,16777215,10086143,16777215,16777215,1137094,16777215,16777215,16777215,3289655,0,16777215,16777215,16777215,11838,16777215,16777215,16777215,16777215,11141282,8696052,16764057,16764057,16764057,16764057,14064512,16777215,11838,15921906,36799,3368601,16777215,16777215,16777215,16777215,16777215,0,8092539,7434613,16777215,14277081,16777215,36799,16777215,4210752,13224393,16777215,16777215,0,1137094,1137094,16777215,16777215,192,7434613,3368601,3506772,16777215,13224393,16777215,16777215,16777215,16777215]
[16777215,16777215,16777215,16777215,192,192,49407,14083051,16777215,8092539,16777215,16777215,16777215,16777215,16777215,16777215,0,15921906,15921906,16777215,16777215,16777215,16777215,16777215,0,11573124,15652797,16777215,16777215,16777215,16777215,16777215,16777215,16777215,16777215,16777215,16777215,16777215,16777215,16777215,16777215,14277081,16777215,5789690,16711680,204,16777215,16777215,16777215,16777215,16777215,16777215,16777215,16711680,16777215,13294830,10086143,16777215,16777215,1137094,16777215,16777215,16777215,3289655,0,16777215,16777215,16777215,11838,16777215,16777215,16777215,16777215,5789690,8696052,10017782,10017782,10017782,10017782,0,16777215,11838,15921906,16777215,16777215,16777215,16777215,16777215,16777215,16777215,0,8092539,16777215,16777215,14277081,16777215,36799,16777215,855309,0,16777215,16777215,0,1137094,1137094,16777215,16777215,192,16777215,16777215,16777215,16777215,0,16777215,16777215,16777215,16777215]
[16777215,16777215,16777215,16777215,9359529,9359529,16777215,16777215,855309,16777215,16777215,16777215,1799573,16777215,16777215,16777215,16777215,16777215,16777215,16777215,16777215,16777215,16777215,16777215,16777215,16777215,16777215,10929378,16728,1281739,16728,15773696,12611584,10498160,10925084,9465920,4525507,1424208,13382400,16764057,16777215,16777215,16777215,16777215,16777215,16777215,36799,0,11352,801923,16777215,16777215,16777215,0,10921638,16777215,16777215,16777215,16777215,16777215,16777215,16777215,16777215,16777215,16777215,11352,16777215,16777215,16777215,16777215,16777215,16777215,16777215,16777215,16777215,16777215,16777215,16777215,16777215,16777215,16777215,16777215,16777215,36799,3368601,16777215,16777215,2593979,16777215,3610052,16777215,16777215,7434613,16777215,16777215,16777215,16777215,16777215,16777215,16777215,16777215,801923,16777215,16777215,16777215,16777215,16777215,9359529,7434613,3368601,1424208,16777215,16777215,16777215,16777215,16777215,16777215]
[16777215,16777215,0,16777215,9359529,9359529,16777215,16777215,855309,16777215,16777215,16777215,1799573,16777215,16777215,3684410,16777215,16777215,16777215,16777215,16777215,16777215,16777215,5855577,16777215,16777215,16777215,10929378,16728,1281739,16728,15773696,12611584,10498160,10925084,9465920,4525507,1424208,13382400,16764057,16777215,16777215,16777215,16777215,16777215,16777215,36799,0,11352,16777215,16777215,16777215,16777215,0,10921638,16777215,16777215,16777215,16777215,16777215,16777215,16777215,16777215,16777215,16777215,11352,0,16777215,16777215,16777215,16777215,0,16777215,16777215,16777215,16777215,16777215,16777215,16777215,16777215,16777215,16777215,16777215,36799,3368601,16777215,16777215,2593979,16777215,3610052,16777215,16777215,7434613,16777215,16777215,16777215,16777215,16777215,16777215,16777215,16777215,801923,0,0,13434828,16777215,16777215,9359529,7434613,3368601,1424208,16777215,16777215,16777215,3506772,16777215,16777215]
[16777215,16777215,0,16777215,9359529,9359529,16777215,16777215,855309,16777215,16777215,16777215,1799573,6740479,16777215,3684410,16777215,16777215,16777215,16777215,6740479,16777215,16777215,5855577,16777215,16777215,16777215,13158,16728,1281739,16728,15773696,12611584,10498160,10925084,9465920,4525507,1424208,13382400,16764057,16777215,0,16777215,16777215,12566463,16777215,36799,16777215,11352,16777215,16777215,16777215,16777215,16777215,10921638,16777215,16777215,16777215,16777215,16777215,16777215,16777215,16777215,16777215,4539865,11352,0,16777215,16777215,16777215,16777215,0,16777215,16777215,16777215,16777215,16777215,16777215,16777215,16777215,204,16777215,16777215,36799,3368601,16777215,16777215,2593979,16777215,16777215,16777215,16777215,7434613,16777215,16777215,16777215,16777215,16777215,16777215,16777215,16777215,801923,0,0,13434828,16777215,16777215,9359529,7434613,3368601,1424208,16777215,16777215,16777215,3506772,16777215,16777215]
[16777215,16777215,0,16777215,9359529,9359529,16777215,16777215,855309,16777215,16777215,16777215,1799573,16777215,16777215,3684410,16777215,16777215,16777215,16777215,16777215,16777215,16777215,5855577,16777215,16777215,16777215,7998,16728,1281739,16728,15773696,12611584,10498160,10925084,9465920,4525507,1424208,13382400,16764057,16777215,49407,16777215,16777215,12566463,16777215,36799,16777215,11352,16777215,16777215,16777215,16777215,16777215,10921638,16777215,16777215,16777215,16777215,16777215,16777215,16777215,16777215,16777215,4539865,11352,0,16777215,16777215,16777215,16777215,0,16777215,16777215,16777215,16777215,16777215,16777215,16777215,16777215,204,16777215,16777215,36799,3368601,16777215,16777215,2593979,16777215,16777215,16777215,16777215,7434613,16777215,16777215,16777215,16777215,16777215,16777215,16777215,16777215,801923,0,0,13434828,16777215,16777215,9359529,7434613,3368601,1424208,16777215,16777215,16777215,3506772,16777215,16777215]
[16777215,16777215,0,16777215,9359529,9359529,16777215,16777215,855309,16777215,16777215,16777215,1799573,0,16777215,3684410,16777215,16777215,16777215,16777215,0,16777215,16777215,5855577,16777215,16777215,16777215,16777215,16728,1281739,16728,15773696,12611584,10498160,10925084,9465920,4525507,1424208,13382400,16764057,16777215,49407,16777215,16777215,12566463,16777215,36799,16777215,16777215,0,16777215,16777215,16777215,16777215,10921638,16777215,16777215,16777215,16777215,16777215,16777215,16777215,16777215,16777215,16777215,16777215,10921638,16777215,16777215,16777215,16777215,0,16777215,16777215,16777215,16777215,16777215,16777215,16777215,16777215,204,16777215,16777215,36799,3368601,16777215,16777215,2593979,16777215,3610052,16777215,16777215,7434613,16777215,16777215,16777215,16777215,16777215,16777215,16777215,16777215,801923,0,0,16777215,16777215,16777215,9359529,3506772,3506772,1424208,16777215,16777215,16777215,3506772,16777215,16777215]
[16777215,16777215,5934,16777215,9359529,9359529,16777215,16777215,4891128,16777215,16777215,16777215,1799573,16777215,16777215,666680,16777215,16777215,6567712,16777215,16777215,16777215,16777215,7434613,16777215,16777215,16777215,16777215,16728,1281739,16728,15773696,12611584,10498160,10925084,9465920,4525507,1424208,13382400,16764057,16777215,0,16777215,16777215,12566463,16777215,36799,0,16777215,16777215,16777215,16777215,16777215,16777215,10921638,16777215,801923,16777215,16777215,16777215,16777215,16777215,16777215,16777215,16777215,16777215,10921638,16777215,16777215,16777215,16777215,666680,16777215,16777215,16777215,16777215,16777215,16777215,16777215,16777215,204,16777215,16777215,36799,3368601,16777215,16777215,2593979,16777215,3610052,0,16777215,7434613,16777215,16777215,16777215,16777215,16777215,16777215,16777215,16777215,10086143,0,16777215,16777215,16777215,16777215,9359529,3506772,3506772,3506772,16777215,16777215,16777215,3506772,16777215,16777215]
[16777215,16777215,5934,16777215,9359529,9359529,24704,16777215,855309,16777215,16777215,16777215,1799573,16777215,16777215,666680,16777215,16777215,16777215,16777215,16777215,5395026,16777215,7434613,16777215,16777215,16777215,16777215,16728,1281739,16728,15773696,12611584,10498160,10925084,9465920,4525507,1424208,13382400,16764057,16777215,16777215,16777215,16777215,12566463,16777215,36799,0,16777215,16777215,16777215,16777215,16777215,16777215,10921638,16777215,1137094,16777215,16777215,16777215,16777215,16777215,16777215,16777215,16777215,16777215,10921638,16777215,16777215,16777215,16777215,666680,16777215,16777215,16777215,16777215,16777215,16777215,16777215,16777215,204,16777215,16777215,36799,3368601,16777215,16777215,2593979,16777215,0,0,16777215,7434613,16777215,16777215,16777215,16777215,16777215,16777215,16777215,16777215,801923,16777215,16777215,16777215,16777215,16777215,9359529,3506772,2315831,3506772,16777215,16777215,16777215,3506772,16777215,16777215]
[16777215,16777215,5934,0,9359529,9359529,16777215,16777215,855309,16777215,3243501,16777215,1799573,666680,16777215,666680,16777215,16777215,16777215,16777215,666680,5395026,16777215,7434613,16777215,16777215,0,16777215,16728,1281739,16728,15773696,12611584,10498160,10925084,9465920,4525507,1424208,13382400,16764057,16777215,16777215,16777215,16777215,12566463,16777215,36799,0,16777215,666680,16777215,13158,0,16777215,10921638,13158,1137094,0,16777215,16777215,16777215,16777215,16777215,16777215,16777215,16777215,10921638,4296113,16777215,16777215,16777215,666680,0,16777215,16777215,16777215,16777215,16777215,16777215,16777215,204,16777215,16777215,36799,16777215,16777215,0,2593979,16777215,16777215,0,16777215,16777215,16777215,16777215,16777215,16777215,16777215,16777215,16777215,16777215,801923,16777215,16777215,16777215,16777215,3243501,9359529,2315831,3506772,3506772,16777215,16777215,16777215,3506772,0,16777215]
[16777215,16777215,16777215,0,9359529,9359529,16777215,16777215,855309,16777215,3243501,16777215,1799573,16777215,16777215,16777215,16777215,16777215,16777215,16777215,16777215,16777215,16777215,16777215,16777215,16777215,15652797,16777215,16728,1281739,16728,15773696,12611584,10498160,10925084,9465920,4525507,1424208,13382400,16764057,16777215,16777215,16777215,16777215,12566463,204,36799,0,16777215,16777215,16777215,13158,0,16777215,10921638,13158,1137094,0,16777215,16777215,16777215,16777215,16777215,16777215,16777215,16777215,10921638,4296113,16777215,16777215,16777215,16777215,0,16777215,16777215,16777215,16777215,16777215,16777215,16777215,16777215,16777215,16777215,36799,16777215,11184814,0,2593979,16777215,16777215,0,16777215,16777215,16777215,16777215,16777215,16777215,16777215,16777215,16777215,11184814,801923,16777215,16777215,16777215,16777215,3243501,3506772,3506772,3506772,3506772,16777215,16777215,16777215,3506772,0,16777215]
[16777215,16777215,16777215,16777215,9359529,9359529,16777215,16777215,855309,16777215,16777215,16777215,1799573,16777215,16777215,16777215,16777215,16777215,16777215,16777215,16777215,16777215,16777215,16777215,16777215,16777215,15652797,16777215,16728,1281739,16728,15773696,12611584,10498160,10925084,9465920,4525507,1424208,13382400,16764057,16777215,16777215,16777215,16777215,16711680,204,36799,0,16777215,16777215,16777215,13158,16777215,16711680,16777215,6966,1137094,16777215,16777215,16777215,16777215,16777215,16777215,16777215,16777215,16777215,16777215,4296113,16777215,16777215,16777215,16777215,16777215,16777215,16777215,16777215,16777215,16777215,16777215,16777215,16777215,16777215,16777215,36799,16777215,16777215,16777215,2593979,16777215,16777215,16777215,16777215,16777215,16777215,16777215,16777215,16777215,16777215,16777215,16777215,16777215,801923,0,16777215,16777215,16777215,16777215,3506772,3506772,3506772,3506772,16777215,16777215,16777215,3506772,16777215,16777215]
[16777215,16777215,16777215,16777215,9359529,9359529,16777215,16777215,855309,16777215,16777215,16777215,1799573,16777215,16777215,16777215,16777215,16777215,16777215,16777215,16777215,16777215,16777215,16777215,16777215,16777215,15652797,7998,16728,1281739,16728,15773696,12611584,10498160,10925084,9465920,4525507,1424208,13382400,16764057,16777215,16777215,16777215,16777215,16711680,204,16777215,0,16777215,16777215,16777215,16777215,16777215,16711680,16777215,16777215,1137094,16777215,16777215,16777215,16777215,16777215,16777215,16777215,16777215,16777215,16777215,1589611,16777215,16777215,16777215,16777215,16777215,16777215,16777215,16777215,16777215,16777215,16777215,16777215,16777215,16777215,16777215,16777215,16777215,16777215,16777215,2593979,16777215,0,0,16777215,16777215,16777215,16777215,16777215,16777215,16777215,16777215,16777215,16777215,801923,801923,16777215,16777215,16777215,16777215,3506772,3506772,3506772,3506772,16777215,16777215,16777215,3506772,16777215,16777215]
[16777215,16777215,5934,16777215,9359529,9359529,16777215,16777215,855309,16777215,16777215,16777215,1799573,666680,49407,666680,16777215,16777215,16777215,16777215,666680,16777215,16777215,7434613,16777215,16777215,15652797,13158,16728,1281739,16728,15773696,12611584,10498160,10925084,9465920,4525507,1424208,13382400,16764057,16777215,16777215,16777215,16777215,16711680,204,16777215,0,16777215,666680,16777215,16777215,16777215,16711680,16777215,16777215,1137094,16777215,16777215,16777215,16777215,16777215,16777215,16777215,16777215,16777215,16777215,4296113,16777215,16777215,16777215,666680,16777215,16777215,8696052,16777215,16777215,16777215,16777215,16777215,16777215,16777215,16777215,16777215,16777215,16777215,16777215,2593979,16777215,3610052,0,16777215,16777215,16777215,16777215,16777215,16777215,16777215,16777215,16777215,16777215,801923,1137094,16777215,16777215,16777215,16777215,3506772,3506772,3506772,3506772,16777215,16777215,16777215,666680,16777215,16777215]
[16777215,16777215,5934,16777215,19816,19816,16777215,5263191,855309,8092539,16777215,8092539,16777215,666680,49407,666680,16777215,801923,0,16777215,666680,16777215,1137094,7434613,0,16777215,15652797,13158,16777215,16777215,16777215,16777215,16777215,16777215,16777215,16777215,16777215,16777215,16777215,16777215,16777215,16777215,16777215,16777215,16711680,204,16777215,0,16777215,666680,16777215,16777215,16777215,16711680,16777215,16777215,1137094,16777215,16777215,1137094,16777215,16777215,16777215,3289655,0,16777215,16777215,4296113,16777215,16777215,16777215,666680,16777215,16777215,8696052,16777215,16777215,16777215,16777215,16777215,16777215,16777215,15921906,16777215,16777215,11184814,16777215,2593979,16777215,3610052,0,16777215,16777215,16777215,16777215,16777215,16777215,16777215,4210752,0,11184814,801923,1137094,801923,801923,16777215,16777215,3506772,16777215,16777215,3506772,16777215,0,16777215,666680,16777215,16777215]
[16777215,16777215,5934,16777215,19816,19816,16777215,14083051,855309,8092539,16777215,8092539,16777215,666680,49407,666680,0,15921906,0,16777215,666680,5395026,1137094,7434613,16777215,11573124,15652797,16777215,16777215,16777215,16777215,16777215,16777215,16777215,16777215,16777215,16777215,16777215,16777215,16777215,16777215,16777215,16777215,16777215,16711680,204,16777215,16777215,16777215,666680,16777215,16777215,16777215,255,16777215,16777215,801923,16777215,16777215,1137094,16777215,16777215,16777215,3289655,3175320,16777215,16777215,4296113,16777215,16777215,16777215,666680,16777215,16777215,8696052,16764057,16764057,16764057,16764057,13005646,16777215,16777215,16777215,16777215,16777215,16777215,16777215,2593979,16777215,16777215,0,16777215,16777215,16777215,16777215,16777215,16777215,16777215,5296274,13224393,16777215,801923,1137094,1137094,1137094,16777215,16777215,3506772,16777215,16777215,3506772,16777215,13224393,16777215,666680,16777215,16777215]
[16777215,16777215,5934,0,19816,19816,16777215,1709849,16777215,8092539,3243501,8092539,16777215,666680,3191504,666680,0,15921906,15921906,16777215,666680,5395026,1137094,7434613,16777215,11573124,15652797,16777215,16777215,16777215,16777215,16777215,16777215,16777215,16777215,16777215,16777215,16777215,16777215,16777215,16777215,0,16777215,42752,16711680,204,36799,16777215,16777215,666680,16777215,16777215,0,16711680,16777215,6966,801923,0,16777215,1137094,16777215,16777215,16777215,3289655,3175320,16777215,16777215,16777215,16777215,16777215,16777215,666680,0,11141282,8696052,16764057,16764057,16764057,16764057,13005646,16777215,16777215,16777215,36799,13158,16777215,0,16777215,16777215,16777215,16777215,16777215,5193523,16777215,16777215,16777215,16777215,16777215,5296274,16777215,16777215,16777215,1137094,1137094,1137094,16777215,3243501,3506772,5193523,13158,3506772,16777215,16777215,16777215,666680,0,16777215]
[16777215,16777215,5934,0,19816,19816,49407,14083051,16777215,8092539,3243501,8092539,16777215,666680,16777215,666680,0,15921906,15921906,16777215,666680,16777215,1137094,7434613,16764159,11573124,0,16777215,16777215,16777215,16777215,16777215,16777215,16777215,16777215,16777215,16777215,16777215,16777215,16777215,0,12566463,16777215,42752,16711680,204,36799,16777215,16777215,666680,16777215,16777215,0,16711680,16777215,13158,801923,0,16777215,1137094,16777215,16777215,16777215,3289655,11447982,16777215,16777215,16777215,16777215,16777215,16777215,666680,0,11141282,8696052,16764057,16764057,16764057,16764057,13005646,16777215,16777215,15921906,36799,13158,16777215,0,16777215,16777215,16777215,16777215,8092539,5193523,16777215,0,16777215,36799,16777215,6740479,13224393,16777215,16777215,1137094,1137094,1137094,16777215,3243501,3506772,5193523,13158,3506772,16777215,13224393,16777215,666680,0,16777215]
[16777215,16777215,16777215,16777215,16777215,16777215,16777215,14083051,16777215,8092539,16777215,16777215,16777215,16777215,16777215,16777215,0,15921906,15921906,16777215,16777215,16777215,16777215,16777215,16777215,11573124,15652797,16777215,16777215,16777215,16777215,16777215,16777215,16777215,16777215,16777215,16777215,16777215,16777215,16777215,12566463,14277081,16777215,42752,16711680,204,36799,16777215,16777215,16777215,16777215,16777215,16777215,16711680,16777215,13158,801923,16777215,16777215,1137094,16777215,16777215,16777215,3289655,11447982,16777215,16777215,16777215,16777215,16777215,16777215,16777215,16777215,11141282,8696052,16764057,16764057,16764057,16764057,13005646,16777215,16777215,16777215,36799,13158,16777215,16777215,16777215,16777215,16777215,0,8092539,5193523,16777215,12566463,16777215,36799,16777215,6740479,16777215,16777215,16777215,1137094,1137094,1137094,16777215,16777215,3506772,5193523,13158,3506772,16777215,16777215,16777215,16777215,16777215,16777215]
[16777215,16777215,16777215,16777215,192,192,16777215,1709849,16777215,16777215,16777215,16777215,16777215,16777215,16777215,16777215,0,15921906,15921906,16777215,16777215,16777215,16777215,16777215,16777215,11573124,15652797,16777215,16777215,16777215,16777215,16777215,16777215,16777215,16777215,16777215,16777215,16777215,16777215,16777215,12566463,14277081,16777215,42752,16711680,204,24704,16777215,16777215,16777215,16777215,16777215,16777215,16711680,16777215,16777215,801923,16777215,16777215,1137094,16777215,16777215,16777215,3289655,0,16777215,16777215,16777215,11838,16777215,16777215,16777215,16777215,11141282,8696052,16764057,16764057,16764057,16764057,13005646,16777215,11838,16777215,24704,13158,16777215,16777215,16777215,16777215,16777215,0,8092539,5193523,16777215,12566463,16777215,36799,16777215,855309,13224393,16777215,16777215,1137094,1137094,1137094,16777215,16777215,192,5193523,13158,16777215,16777215,13224393,16777215,16777215,16777215,16777215]
[16777215,16777215,16777215,16777215,192,192,16777215,14083051,16777215,16777215,16777215,16777215,16777215,16777215,16777215,16777215,0,15921906,15921906,16777215,16777215,16777215,16777215,16777215,0,11573124,15652797,16777215,16777215,16777215,16777215,16777215,16777215,16777215,16777215,16777215,16777215,16777215,16777215,16777215,16777215,14277081,16777215,42752,16711680,204,36799,16777215,16777215,16777215,16777215,16777215,16777215,16711680,16777215,16777215,801923,16777215,16777215,1137094,16777215,16777215,16777215,3289655,16777215,16777215,16777215,16777215,11838,16777215,16777215,16777215,16777215,11141282,8696052,16764057,16764057,16764057,16764057,13005646,16777215,11838,16777215,36799,16777215,16777215,16777215,16777215,16777215,16777215,0,8092539,16777215,16777215,14277081,16777215,36799,16777215,855309,0,16777215,16777215,1137094,1137094,1137094,16777215,16777215,192,16777215,16777215,16777215,16777215,0,16777215,16777215,16777215,16777215]
[16777215,16777215,16777215,16777215,192,192,16777215,14083051,16777215,16777215,16777215,16777215,16777215,16777215,16777215,16777215,0,15921906,15921906,16777215,16777215,16777215,16777215,16777215,16777215,11573124,15652797,16777215,16777215,16777215,16777215,16777215,16777215,16777215,16777215,16777215,16777215,16777215,16777215,16777215,16777215,14277081,16777215,5789690,16711680,204,16777215,16777215,16777215,16777215,16777215,16777215,16777215,16711680,16777215,13294830,801923,16777215,16777215,1137094,16777215,16777215,16777215,3289655,16777215,16777215,16777215,16777215,11838,16777215,16777215,16777215,16777215,5789690,8696052,16764057,16764057,16764057,16764057,13005646,16777215,11838,16777215,16777215,16777215,16777215,16777215,16777215,16777215,16777215,0,8092539,16777215,16777215,14277081,16777215,36799,16777215,855309,16777215,16777215,16777215,1137094,1137094,1137094,16777215,16777215,192,16777215,16777215,16777215,16777215,16777215,16777215,16777215,16777215,16777215]
[16777215,16777215,16777215,16777215,9359529,9359529,16777215,16777215,855309,16777215,16777215,16777215,1799573,16777215,16777215,16777215,16777215,16777215,16777215,16777215,16777215,16777215,16777215,16777215,16777215,16777215,16777215,10929378,16728,1281739,16728,15773696,12611584,10498160,10925084,9465920,4525507,1424208,13382400,16764057,16777215,16777215,16777215,16777215,16777215,16777215,36799,0,16777215,16777215,16777215,16777215,16777215,0,10921638,16777215,16777215,16777215,16777215,16777215,16777215,16777215,16777215,16777215,16777215,16777215,16777215,16777215,16777215,16777215,16777215,16777215,16777215,16777215,16777215,16777215,16777215,16777215,16777215,16777215,16777215,16777215,16777215,36799,3368601,16777215,16777215,2593979,16777215,16777215,16777215,16777215,7434613,16777215,16777215,16777215,16777215,16777215,16777215,16777215,16777215,801923,16777215,16777215,16777215,16777215,16777215,9359529,7434613,3368601,1424208,16777215,16777215,16777215,16777215,16777215,16777215]
[16777215,16777215,0,16777215,9359529,9359529,16777215,16777215,855309,16777215,16777215,16777215,1799573,16777215,16777215,3684410,16777215,16777215,16777215,16777215,16777215,16777215,16777215,5855577,16777215,16777215,16777215,13158,16728,1281739,16728,15773696,12611584,10498160,10925084,9465920,4525507,1424208,13382400,16764057,16777215,16777215,16777215,16777215,12566463,16777215,36799,0,16777215,16777215,16777215,16777215,16777215,16777215,10921638,16777215,16777215,16777215,16777215,16777215,16777215,16777215,16777215,16777215,4539865,16777215,0,16777215,16777215,16777215,16777215,0,16777215,16777215,16777215,16777215,16777215,16777215,16777215,16777215,16777215,16777215,16777215,36799,3368601,16777215,16777215,2593979,16777215,16777215,16777215,16777215,7434613,16777215,16777215,16777215,16777215,16777215,16777215,16777215,16777215,801923,16777215,16777215,16777215,16777215,16777215,9359529,7434613,3368601,1424208,16777215,16777215,16777215,16777215,16777215,16777215]
[16777215,16777215,0,16777215,9359529,9359529,16777215,16777215,855309,16777215,16777215,16777215,1799573,16777215,16777215,3684410,16777215,16777215,16777215,16777215,16777215,16777215,16777215,5855577,16777215,16777215,16777215,13158,16728,1281739,16728,15773696,12611584,10498160,10925084,9465920,4525507,1424208,13382400,16764057,16777215,16777215,16777215,16777215,12566463,16777215,36799,16777215,16777215,16777215,16777215,16777215,16777215,16777215,10921638,16777215,16777215,16777215,16777215,16777215,16777215,16777215,16777215,16777215,4539865,16777215,0,16777215,16777215,16777215,16777215,0,16777215,16777215,16777215,16777215,16777215,16777215,16777215,16777215,204,16777215,16777215,36799,3368601,16777215,16777215,2593979,16777215,16777215,16777215,16777215,7434613,16777215,16777215,16777215,16777215,16777215,16777215,16777215,16777215,801923,16777215,16777215,16777215,16777215,16777215,9359529,7434613,3368601,1424208,16777215,16777215,16777215,3506772,16777215,16777215]
[16777215,16777215,0,16777215,9359529,9359529,16777215,16777215,855309,16777215,16777215,16777215,1799573,0,16777215,3684410,16777215,16777215,16777215,16777215,0,16777215,16777215,5855577,16777215,16777215,16777215,16777215,16728,1281739,16728,15773696,12611584,10498160,10925084,9465920,4525507,1424208,13382400,16764057,16777215,0,16777215,16777215,12566463,16777215,36799,16777215,16777215,0,16777215,16777215,16777215,16777215,10921638,16777215,16777215,16777215,16777215,16777215,16777215,16777215,16777215,16777215,16777215,16777215,10921638,16777215,16777215,16777215,16777215,0,16777215,16777215,16777215,16777215,16777215,16777215,16777215,16777215,204,16777215,16777215,36799,3368601,16777215,16777215,2593979,16777215,16777215,16777215,16777215,7434613,16777215,16777215,16777215,16777215,16777215,16777215,16777215,16777215,801923,16777215,16777215,16777215,16777215,16777215,9359529,7434613,3368601,1424208,16777215,16777215,16777215,3506772,16777215,16777215]
[16777215,16777215,5934,16777215,9359529,9359529,16777215,16777215,855309,16777215,16777215,16777215,1799573,16777215,16777215,666680,16777215,16777215,16777215,16777215,16777215,16777215,16777215,7434613,16777215,16777215,16777215,16777215,16728,1281739,16728,15773696,12611584,10498160,10925084,9465920,4525507,1424208,13382400,16764057,16777215,0,16777215,16777215,12566463,16777215,36799,16777215,16777215,16777215,16777215,16777215,16777215,16777215,10921638,16777215,16777215,16777215,16777215,16777215,16777215,16777215,16777215,16777215,16777215,16777215,10921638,16777215,16777215,16777215,16777215,666680,16777215,16777215,16777215,16777215,16777215,16777215,16777215,16777215,204,16777215,16777215,36799,3368601,16777215,16777215,2593979,16777215,0,16777215,16777215,7434613,16777215,16777215,16777215,16777215,16777215,16777215,16777215,16777215,801923,16777215,16777215,16777215,16777215,16777215,9359529,7434613,3368601,1424208,16777215,16777215,16777215,3506772,16777215,16777215]
[16777215,16777215,5934,16777215,9359529,9359529,24704,16777215,855309,16777215,16777215,16777215,1799573,16777215,16777215,666680,16777215,16777215,16777215,16777215,16777215,16777215,16777215,7434613,16777215,16777215,16777215,16777215,16728,1281739,16728,15773696,12611584,10498160,10925084,9465920,4525507,1424208,13382400,16764057,16777215,16777215,16777215,16777215,12566463,16777215,36799,16777215,16777215,16777215,16777215,16777215,16777215,16777215,10921638,16777215,16777215,16777215,16777215,16777215,16777215,16777215,16777215,16777215,16777215,16777215,10921638,16777215,16777215,16777215,16777215,666680,16777215,16777215,16777215,16777215,16777215,16777215,16777215,16777215,204,16777215,16777215,36799,3368601,16777215,16777215,2593979,16777215,0,16777215,16777215,7434613,16777215,16777215,16777215,16777215,16777215,16777215,16777215,16777215,801923,16777215,16777215,16777215,16777215,16777215,9359529,7434613,3368601,1424208,16777215,16777215,16777215,3506772,16777215,16777215]
[16777215,16777215,5934,16777215,9359529,9359529,16777215,16777215,855309,16777215,16777215,16777215,1799573,16777215,16777215,666680,16777215,16777215,16777215,16777215,16777215,16777215,16777215,7434613,16777215,16777215,16777215,16777215,16728,1281739,16728,15773696,12611584,10498160,10925084,9465920,4525507,1424208,13382400,16764057,16777215,16777215,16777215,16777215,12566463,16777215,36799,16777215,16777215,16777215,16777215,16777215,16777215,16777215,10921638,16777215,801923,16777215,16777215,16777215,16777215,16777215,16777215,16777215,16777215,16777215,10921638,16777215,16777215,16777215,16777215,666680,16777215,16777215,16777215,16777215,16777215,16777215,16777215,16777215,204,16777215,16777215,36799,3368601,16777215,16777215,2593979,16777215,16777215,0,16777215,7434613,16777215,16777215,16777215,16777215,16777215,16777215,16777215,16777215,801923,16777215,16777215,16777215,16777215,16777215,9359529,3506772,3506772,1424208,16777215,16777215,16777215,3506772,16777215,16777215]
[16777215,16777215,5934,16777215,9359529,9359529,16777215,16777215,855309,16777215,16777215,16777215,1799573,666680,16777215,666680,16777215,16777215,16777215,16777215,666680,16777215,16777215,7434613,16777215,16777215,0,16777215,16728,1281739,16728,15773696,12611584,10498160,10925084,9465920,4525507,1424208,13382400,16764057,16777215,16777215,16777215,16777215,12566463,16777215,36799,16777215,16777215,666680,16777215,16777215,16777215,16777215,10921638,13158,801923,16777215,16777215,16777215,16777215,16777215,16777215,16777215,16777215,16777215,10921638,16777215,16777215,16777215,16777215,666680,16777215,16777215,16777215,16777215,16777215,16777215,16777215,16777215,16777215,16777215,16777215,36799,16777215,16777215,16777215,2593979,16777215,16777215,0,16777215,16777215,16777215,16777215,16777215,16777215,16777215,16777215,16777215,16777215,801923,16777215,16777215,16777215,16777215,16777215,9359529,2315831,3506772,3506772,16777215,16777215,16777215,3506772,16777215,16777215]
[16777215,16777215,16777215,16777215,9359529,9359529,16777215,16777215,855309,16777215,16777215,16777215,1799573,16777215,16777215,16777215,16777215,16777215,16777215,16777215,16777215,16777215,16777215,16777215,16777215,16777215,15652797,16777215,16728,1281739,16728,15773696,12611584,10498160,10925084,9465920,4525507,1424208,13382400,16764057,16777215,16777215,16777215,16777215,12566463,204,16777215,0,16777215,16777215,16777215,16777215,16777215,16777215,10921638,13158,801923,16777215,16777215,16777215,16777215,16777215,16777215,16777215,16777215,16777215,10921638,4296113,16777215,16777215,16777215,16777215,16777215,16777215,16777215,16777215,16777215,16777215,16777215,16777215,16777215,16777215,16777215,16777215,16777215,16777215,16777215,2593979,16777215,16777215,0,16777215,16777215,16777215,16777215,16777215,16777215,16777215,16777215,16777215,16777215,801923,16777215,16777215,16777215,16777215,16777215,3506772,3506772,3506772,3506772,16777215,16777215,16777215,3506772,16777215,16777215]
[16777215,16777215,16777215,16777215,9359529,9359529,16777215,16777215,855309,16777215,16777215,16777215,1799573,16777215,16777215,16777215,16777215,16777215,16777215,16777215,16777215,16777215,16777215,16777215,16777215,16777215,15652797,16777215,16728,1281739,16728,15773696,12611584,10498160,10925084,9465920,4525507,1424208,13382400,16764057,16777215,16777215,16777215,16777215,16711680,204,16777215,0,16777215,16777215,16777215,16777215,16777215,16711680,16777215,16777215,801923,16777215,16777215,16777215,16777215,16777215,16777215,16777215,16777215,16777215,16777215,4296113,16777215,16777215,16777215,16777215,16777215,16777215,16777215,16777215,16777215,16777215,16777215,16777215,16777215,16777215,16777215,16777215,16777215,16777215,16777215,2593979,16777215,16777215,16777215,16777215,16777215,16777215,16777215,16777215,16777215,16777215,16777215,16777215,16777215,801923,0,16777215,16777215,16777215,16777215,3506772,3506772,3506772,3506772,16777215,16777215,16777215,3506772,16777215,16777215]
[16777215,16777215,16777215,16777215,9359529,9359529,16777215,16777215,855309,16777215,16777215,16777215,1799573,16777215,16777215,16777215,16777215,16777215,16777215,16777215,16777215,16777215,16777215,16777215,16777215,16777215,15652797,16777215,16728,1281739,16728,15773696,12611584,10498160,10925084,9465920,4525507,1424208,13382400,16764057,16777215,16777215,16777215,16777215,16711680,204,16777215,16777215,16777215,16777215,16777215,16777215,16777215,16711680,16777215,16777215,801923,16777215,16777215,16777215,16777215,16777215,16777215,16777215,16777215,16777215,16777215,1589611,16777215,16777215,16777215,16777215,16777215,16777215,16777215,16777215,16777215,16777215,16777215,16777215,16777215,16777215,16777215,16777215,16777215,16777215,16777215,2593979,16777215,16777215,16777215,16777215,16777215,16777215,16777215,16777215,16777215,16777215,16777215,16777215,16777215,801923,801923,16777215,16777215,16777215,16777215,3506772,3506772,3506772,3506772,16777215,16777215,16777215,16777215,16777215,16777215]
[16777215,16777215,16777215,16777215,9359529,9359529,16777215,16777215,855309,16777215,16777215,16777215,16777215,16777215,49407,16777215,16777215,16777215,16777215,16777215,16777215,16777215,16777215,16777215,16777215,16777215,15652797,13158,16728,1281739,16728,15773696,12611584,10498160,10925084,9465920,4525507,1424208,13382400,16764057,16777215,16777215,16777215,16777215,16711680,204,16777215,0,16777215,16777215,16777215,16777215,16777215,16711680,16777215,16777215,801923,16777215,16777215,16777215,16777215,16777215,16777215,16777215,16777215,16777215,16777215,4296113,16777215,16777215,16777215,16777215,16777215,16777215,16777215,16777215,16777215,16777215,16777215,16777215,16777215,16777215,16777215,16777215,16777215,16777215,16777215,2593979,16777215,0,0,16777215,16777215,16777215,16777215,16777215,16777215,16777215,16777215,16777215,16777215,801923,1137094,16777215,16777215,16777215,16777215,3506772,16777215,16777215,3506772,16777215,16777215,16777215,16777215,16777215,16777215]
[16777215,16777215,16777215,16777215,19816,19816,16777215,16777215,16777215,16777215,16777215,16777215,16777215,16777215,49407,16777215,16777215,801923,0,16777215,16777215,16777215,16777215,16777215,0,16777215,15652797,13158,16777215,16777215,16777215,16777215,16777215,16777215,16777215,16777215,16777215,16777215,16777215,16777215,16777215,16777215,16777215,16777215,16711680,204,16777215,0,16777215,16777215,16777215,16777215,16777215,16711680,16777215,16777215,801923,16777215,16777215,1137094,16777215,16777215,16777215,3289655,0,16777215,16777215,4296113,16777215,16777215,16777215,16777215,16777215,16777215,8696052,16777215,16777215,16777215,16777215,16777215,16777215,16777215,15921906,16777215,16777215,16777215,16777215,16777215,16777215,0,0,16777215,16777215,16777215,16777215,16777215,16777215,16777215,16777215,0,16777215,16777215,1137094,801923,801923,16777215,16777215,3506772,16777215,16777215,3506772,16777215,0,16777215,16777215,16777215,16777215]
[16777215,16777215,16777215,16777215,19816,19816,16777215,5263191,16777215,8092539,16777215,8092539,16777215,16777215,49407,16777215,0,15921906,0,16777215,16777215,16777215,1137094,16777215,16777215,11573124,15652797,16777215,16777215,16777215,16777215,16777215,16777215,16777215,16777215,16777215,16777215,16777215,16777215,16777215,16777215,16777215,16777215,16777215,16711680,204,16777215,16777215,16777215,16777215,16777215,16777215,16777215,16711680,16777215,16777215,16777215,16777215,16777215,1137094,16777215,16777215,16777215,3289655,3175320,16777215,16777215,16777215,16777215,16777215,16777215,16777215,16777215,16777215,8696052,16764057,16764057,16764057,16764057,9325614,16777215,16777215,16777215,16777215,16777215,16777215,16777215,16777215,16777215,16777215,0,16777215,16777215,16777215,16777215,16777215,16777215,16777215,16777215,13224393,16777215,16777215,1137094,1137094,1137094,16777215,16777215,3506772,16777215,16777215,3506772,16777215,13224393,16777215,16777215,16777215,16777215]
[16777215,16777215,16777215,16777215,19816,19816,16777215,1709849,16777215,8092539,16777215,8092539,16777215,16777215,3191504,16777215,0,15921906,15921906,16777215,16777215,16777215,1137094,16777215,16777215,11573124,15652797,16777215,16777215,16777215,16777215,16777215,16777215,16777215,16777215,16777215,16777215,16777215,16777215,16777215,16777215,0,16777215,42752,16711680,204,16777215,16777215,16777215,16777215,16777215,16777215,16777215,16711680,16777215,16777215,16777215,16777215,16777215,1137094,16777215,16777215,16777215,3289655,11447982,16777215,16777215,16777215,16777215,16777215,16777215,16777215,16777215,11141282,8696052,16764057,16764057,16764057,16764057,9325614,16777215,16777215,16777215,16777215,16777215,16777215,16777215,16777215,16777215,16777215,16777215,16777215,16777215,16777215,16777215,16777215,16777215,16777215,16777215,16777215,16777215,16777215,1137094,1137094,1137094,16777215,16777215,3506772,16777215,16777215,3506772,16777215,16777215,16777215,16777215,16777215,16777215]
[16777215,16777215,16777215,16777215,19816,19816,49407,14083051,16777215,8092539,16777215,8092539,16777215,16777215,16777215,16777215,0,15921906,15921906,16777215,16777215,16777215,1137094,16777215,16777215,11573124,15652797,16777215,16777215,16777215,16777215,16777215,16777215,16777215,16777215,16777215,16777215,16777215,16777215,16777215,0,12566463,16777215,42752,16711680,204,16777215,16777215,16777215,16777215,16777215,16777215,16777215,16711680,16777215,13158,801923,16777215,16777215,1137094,16777215,16777215,16777215,3289655,3175320,16777215,16777215,16777215,16777215,16777215,16777215,16777215,16777215,11141282,8696052,16764057,16764057,16764057,16764057,9325614,16777215,16777215,15921906,16777215,16777215,16777215,16777215,16777215,16777215,16777215,16777215,8092539,16777215,16777215,0,16777215,16777215,16777215,16777215,16777215,16777215,16777215,1137094,1137094,1137094,16777215,16777215,3506772,16777215,16777215,16777215,16777215,16777215,16777215,16777215,16777215,16777215]
[16777215,16777215,16777215,16777215,19816,19816,16777215,1709849,16777215,8092539,16777215,16777215,16777215,16777215,16777215,16777215,0,15921906,15921906,16777215,16777215,16777215,16777215,16777215,16777215,11573124,15652797,16777215,16777215,16777215,16777215,16777215,16777215,16777215,16777215,16777215,16777215,16777215,16777215,16777215,12566463,14277081,16777215,42752,16711680,204,36799,16777215,16777215,16777215,16777215,16777215,16777215,16711680,16777215,13158,801923,16777215,16777215,1137094,16777215,16777215,16777215,3289655,11447982,16777215,16777215,16777215,16777215,16777215,16777215,16777215,16777215,11141282,8696052,16764057,16764057,16764057,16764057,9325614,16777215,16777215,16777215,36799,16777215,16777215,16777215,16777215,16777215,16777215,16777215,8092539,16777215,16777215,12566463,16777215,36799,16777215,16777215,16777215,16777215,16777215,1137094,1137094,1137094,16777215,16777215,19816,16777215,16777215,16777215,16777215,16777215,16777215,16777215,16777215,16777215]
[16777215,16777215,16777215,16777215,192,192,16777215,1709849,16777215,16777215,16777215,16777215,16777215,16777215,16777215,16777215,0,15921906,15921906,16777215,16777215,16777215,16777215,16777215,16777215,11573124,15652797,16777215,16777215,16777215,16777215,16777215,16777215,16777215,16777215,16777215,16777215,16777215,16777215,16777215,12566463,14277081,16777215,42752,16711680,204,36799,16777215,16777215,16777215,16777215,16777215,16777215,16711680,16777215,16777215,801923,16777215,16777215,1137094,16777215,16777215,16777215,3289655,0,16777215,16777215,16777215,16777215,16777215,16777215,16777215,16777215,11141282,8696052,16764057,16764057,16764057,16764057,9325614,16777215,16777215,16777215,36799,16777215,16777215,16777215,16777215,16777215,16777215,0,8092539,16777215,16777215,12566463,16777215,36799,16777215,16777215,13224393,16777215,16777215,1137094,1137094,1137094,16777215,16777215,192,16777215,16777215,16777215,16777215,13224393,16777215,16777215,16777215,16777215]
[16777215,16777215,16777215,16777215,192,192,16777215,14083051,16777215,16777215,16777215,16777215,16777215,16777215,16777215,16777215,0,15921906,15921906,16777215,16777215,16777215,16777215,16777215,0,11573124,15652797,16777215,16777215,16777215,16777215,16777215,16777215,16777215,16777215,16777215,16777215,16777215,16777215,16777215,16777215,14277081,16777215,42752,16711680,204,16777215,16777215,16777215,16777215,16777215,16777215,16777215,16711680,16777215,16777215,801923,16777215,16777215,1137094,16777215,16777215,16777215,16777215,16777215,16777215,16777215,16777215,11838,16777215,16777215,16777215,16777215,11141282,8696052,16764057,16764057,16764057,16764057,9325614,16777215,11838,16777215,16777215,16777215,16777215,16777215,16777215,16777215,16777215,0,8092539,16777215,16777215,14277081,16777215,36799,16777215,16777215,0,16777215,16777215,1137094,1137094,1137094,16777215,16777215,192,16777215,16777215,16777215,16777215,0,16777215,16777215,16777215,16777215]
[16777215,16777215,16777215,16777215,192,192,16777215,1709849,16777215,16777215,16777215,16777215,16777215,16777215,16777215,16777215,0,15921906,15921906,16777215,16777215,16777215,16777215,16777215,16777215,11573124,15652797,16777215,16777215,16777215,16777215,16777215,16777215,16777215,16777215,16777215,16777215,16777215,16777215,16777215,14277081,14277081,16777215,5789690,16711680,204,16777215,16777215,16777215,16777215,16777215,16777215,16777215,16711680,16777215,16777215,801923,16777215,16777215,1137094,16777215,16777215,16777215,16777215,16777215,16777215,16777215,16777215,11838,16777215,16777215,16777215,16777215,5789690,8696052,16764057,16764057,16764057,16764057,9325614,16777215,11838,16777215,16777215,16777215,16777215,16777215,16777215,16777215,16777215,0,8092539,16777215,16777215,14277081,16777215,36799,16777215,16777215,16777215,16777215,16777215,1137094,1137094,1137094,16777215,16777215,192,16777215,16777215,16777215,16777215,16777215,16777215,16777215,16777215,16777215]

{"sheet":"rennfarben","index":4,"n_rows":9,"n_cols":4,"rows_kept":9,"cut":false,"hidden":true,"merged":[]}
["Standardbild","Vorlage 1","Vorlage 2","Vorlage 3"]
[36799,16777215,16777215,16777215]
[36799,16777215,16777215,16777215]
[36799,16777215,16777215,16777215]
[36799,16777215,16777215,16777215]
[36799,16777215,16777215,0]
[36799,16777215,0,16777215]
[36799,0,16777215,16777215]
[36799,16777215,16777215,16777215]

{"sheet":"rennfarben2","index":5,"n_rows":9,"n_cols":105,"rows_kept":9,"cut":false,"hidden":true,"merged":[]}
["Adonijo","Ailton","Al Capone","Äther","AustrianStallion","AustrianStallion (mit Maulschutz)","Besenwagen","Binary","Black Beauty","Bob","Boccaccio","Chefchen","Chewbacca","Cora","Danny DeVito","Dark Knight Rising","Darkwing","De Bij","De Wesp","Diversity","Duli","Easy","Elektrogaul","Ente Süß Sauer","Feenstaub","Felaróf","Fellow Horse","Frank the Highlander","Galopper des Jahrtausends","Galopper des Jahrtausends 1","Galopper des Jahrtausends 2","Galopper des Jahrtausends 3","Galopper des Jahrtausends 4","Galopper des Jahrtausends 5","Galopper des Jahrtausends 6","Galopper des Jahrtausends 7","Galopper des Jahrtausends 8","Galopper des Jahrtausends 9","Galopper des Jahrtausends 10","Galopper des Jahrtausends 11","Ghost","Grashüpfer","Graupi","Green Tentacle","Herr Nilson","Honeyjune","HORSE_2","IboProfen","JohnnyPony","Joint","Jolly Jumper","Kalle","Kieler Sprotte","Kleiner Onkel","Ladybird","Lampard One","Langes Elend","Liese (2019)","Liese (2020)","Louis","Lula von Elmshorn","Mohrenköpfle","Momentum III","Momentum III (mit Maulschutz)","Mordhorse","Mysekaja","Niki","Old Moe","Onepointninebillion","Ono Sternengalopp","Pablo WhiteNose","Pommes Rot Weiß","Pride of Doom","Purple Tentacle","Ramba-Zamba","Rennpony","Rennpony (gesattelt)","Rennpony (mit Maulschutz)","Rennpony (GMP 2020)","Rennpony (CCup 2021)","Rosso Corsa","Run Algorithm Run","Sa'Yaan","Schalk im Nacken","Scharfer Maxx","Schnecki","Shadow of Doom","Shetler-Pony","SiegOderWurst2","Sir Oliver","Sir Prance-a-lot","SolMan","Stallone Gorgon Zola","Stampede","Sternengalopp","Suppenschüssel","Tricky Treasury","Tútastic","Velociraptext","Wandissimo","Wirbelwind","Yulifee","Zimtstern","Zimtstern (2)","Zimtstern (mit Maulschutz)"]
[3688550,36799,5934,192,192,192,49407,3354921,855309,130,0,0,0,7434613,65535,0,10225233,16777215,16777215,11837123,26367,11823615,null,16777215,6299648,16777215,15123099,10929378,65280,1281739,16728,15773696,12611584,10498160,10925084,9465920,4525507,1424208,13382400,16764057,13274093,12611584,16764108,42752,65535,16711935,null,16777215,0,6299648,65535,3368601,11500082,65535,16711935,13294830,null,246,6740479,16737792,6488294,11500082,3289655,3289655,0,1647487,10921638,3381759,11838,0,36799,16777215,801923,11141282,2785494,16764057,16764057,16764057,16764057,16379883,204,11838,16777215,36799,3368601,2159381,7881510,15123099,14277081,3610052,0,9851952,5193523,192,16777215,8696052,420095,0,5287936,8696052,16250641,801923,3394611,3394611,3394611]
[3688550,36799,5934,192,192,192,49407,3354921,855309,130,0,0,0,7434613,65535,0,0,16777215,16777215,11837123,26367,11823615,null,16777215,6299648,16777215,15123099,13158,65280,1281739,16728,15773696,12611584,10498160,10925084,9465920,4525507,1424208,13382400,16764057,13274093,12611584,16764108,42752,49407,16711935,null,16777215,16777215,6299648,16777215,13158,11500082,442618,16711935,13158,null,246,6740479,16737792,6488294,11500082,3289655,3289655,255,1647487,10921638,3381759,11838,15921906,36799,16777215,801923,11141282,2785494,16764057,16764057,16764057,16764057,15917014,204,11838,16777215,36799,3368601,2159381,7881510,15123099,4210752,3610052,0,9851952,5193523,0,16777215,8696052,420095,0,5287936,8696052,16250641,801923,3394611,3394611,3394611]
[3688550,36799,5934,192,192,192,801923,3354921,855309,130,0,0,0,7434613,65535,0,0,16777215,16777215,11837123,26367,11823615,null,16777215,6299648,16777215,15123099,13158,65280,1281739,16728,15773696,12611584,10498160,10925084,9465920,4525507,1424208,13382400,16764057,13274093,12611584,16764108,42752,255,16711935,null,16777215,0,6299648,10921638,0,11500082,255,16711935,13158,null,246,6740479,16737792,6488294,11500082,3289655,3289655,9437183,1647487,10921638,3381759,11838,15921906,36799,255,801923,11141282,2785494,16764057,16764057,16764057,16764057,15454147,204,11838,16777215,36799,3368601,2159381,7881510,15123099,4210752,3610052,0,9851952,5193523,192,16777215,8696052,420095,0,5287936,8696052,16250641,801923,3394611,3394611,3394611]
[3688550,36799,5934,192,16777215,16777215,801923,3354921,855309,130,0,0,0,7434613,65535,0,0,16777215,16777215,11837123,26367,11823615,null,16777215,6299648,16777215,15123099,10929378,65280,1281739,16728,15773696,12611584,10498160,10925084,9465920,4525507,1424208,10092543,10092543,13274093,12611584,16764108,42752,10040319,16711935,null,16777215,16777215,6299648,65535,13158,11500082,10040319,16711935,13294830,null,246,6740479,16737792,6488294,11500082,3289655,3289655,0,1647487,10921638,3381759,11838,15921906,36799,255,801923,11141282,2785494,16764057,16764057,16764057,16764057,14726304,204,11838,16777215,24704,3368601,2159381,7881510,15123099,4210752,3610052,0,9851952,5193523,0,16777215,8696052,420095,0,5296274,8696052,16250641,801923,3394611,3394611,3394611]
[10053375,36799,5934,192,16777215,16777215,801923,3354921,1137094,130,0,0,0,7434613,65535,0,0,3019474,16777215,11837123,26367,11823615,null,255,6299648,16777215,15123099,10929378,65280,1281739,16728,15773696,12611584,10498160,10925084,9465920,4525507,1424208,10092543,10092543,13274093,12611584,16764108,42752,16711884,16711935,null,0,0,6299648,16777215,0,11500082,16711884,16711935,13294830,null,246,6740479,16737792,6488294,65535,0,0,255,1647487,10921638,3381759,11838,10053375,36799,16777215,801923,11141282,2785494,16764057,16764057,16764057,10017782,14064512,204,11838,15134446,24704,6740479,2159381,7881510,15123099,4210752,3610052,0,9851952,6740479,192,16777215,8696052,420095,0,5296274,8696052,16250641,10086143,65535,65535,65535]
[1842988,36799,5934,192,192,192,801923,3354921,4891128,130,0,0,0,7434613,65535,0,0,3019474,3019474,11837123,26367,11823615,null,255,6299648,16777215,15123099,10929378,65280,1281739,16728,15773696,12611584,10498160,10925084,9465920,4525507,1424208,10092543,10092543,13274093,12611584,16764108,42752,16737792,16711935,null,0,16777215,6299648,10921638,13158,11500082,16737792,16711935,13294830,null,246,0,16737792,6488294,65535,0,0,9437183,1647487,204,3381759,11838,10053375,36799,16777215,801923,11141282,2785494,16764057,16764057,16764057,5935018,13005646,204,11838,15134446,36799,6740479,2159381,7881510,15123099,14277081,3610052,0,9851952,6740479,0,16777215,8696052,420095,0,10086143,8696052,16250641,10086143,65535,65535,65535]
[1842988,36799,5934,192,192,192,49407,3354921,801923,130,0,0,0,7434613,65535,0,10225233,3019474,3019474,11837123,26367,11823615,null,255,6299648,16777215,15123099,13158,65280,1281739,16728,15773696,12611584,10498160,10925084,9465920,4525507,1424208,13382400,16764057,13274093,12611584,16764108,42752,13484805,16711935,null,0,0,6299648,65535,3368601,11500082,13484805,16711935,13158,null,246,3243501,16737792,6488294,65535,3289655,3289655,0,1647487,204,3381759,11838,0,36799,255,255,11141282,2785494,16764057,16764057,16764057,16764057,11427128,65535,11838,16777215,24704,3368601,2159381,7881510,15123099,14277081,3610052,0,9851952,5193523,192,16777215,8696052,420095,0,0,8696052,16250641,10086143,255,255,255]
[3688550,36799,5934,192,192,192,49407,3354921,2500134,130,0,0,0,7434613,65535,0,0,16777215,16777215,11837123,26367,11823615,null,255,6299648,16777215,15123099,10929378,65280,1281739,16728,15773696,12611584,10498160,10925084,9465920,4525507,1424208,13382400,16764057,13274093,12611584,16764108,42752,65280,16711935,null,0,16777215,6299648,16777215,13158,11500082,65280,16711935,13294830,null,246,3243501,16737792,6488294,65535,3289655,3289655,255,1647487,10921638,3381759,11838,15921906,36799,255,11184814,11141282,2785494,16764057,16764057,16764057,16764057,9325614,204,11838,13553360,36799,3368601,2159381,7881510,15123099,4210752,3610052,0,9851952,5193523,0,16777215,8696052,420095,0,0,8696052,16250641,1137094,255,255,255]

{"sheet":"info","index":6,"n_rows":0,"n_cols":0,"rows_kept":0,"cut":false,"hidden":true,"merged":[]}